# bench EOLE photo, generated by bep version 0.1, generation model "A"
bEpInstance_A_20_27
     20     27    100   1000     30     60     50    250    100    4.0
      1     66    135     34     35    235     74
      2     70    439     52    339    539    138
      3     72    258     52    158    358    118
      4     30    363     37    263    463    124
      5     87    590     35    490    690    114
      6     40    660     58    560    760    242
      7     64    372     48    272    472    190
      8     92    382     31    282    482    165
      9     52    192     51     92    292     93
     10     63    424     50    324    524    120
     11     68    382     51    282    482    247
     12     75    927     40    827   1027    171
     13     52    525     58    425    625    234
     14     18    845     57    745    945    214
     15     21    458     46    358    558     76
     16     84    560     52    460    660    121
     17     75    410     47    310    510    127
     18     84    229     52    129    329    153
     19     61    427     45    327    527    121
     20     35    853     59    753    953    224
      0     76     30     57    113    131     59     62     14     72     61    198     97    177     81    106     68     23     73    179
     76      0     45     21     37     55     16     15     61      4     14    122     21    102     13     30      7     52      3    103
     30     45      0     28     83    100     28     31     17     41     31    167     66    147     51     75     38      7     42    149
     57     21     28      0     58     74      8     16     43     17     10    141     40    120     23     51     16     36     17    122
    113     37     83     58      0     21     54     52     99     41     52     84     18     66     36      7     45     90     41     67
    131     55    100     74     21      0     72     70    117     59     69     67     33     46     50     27     63    108     58     48
     59     16     28      8     54     72      0      7     45     13      2    138     38    118     24     47      9     36     13    120
     62     15     31     16     52     70      7      0     48     12      6    136     37    117     26     44      8     38     13    118
     14     61     17     43     99    117     45     48      0     58     47    183     83    163     66     92     54     12     58    165
     72      4     41     17     41     59     13     12     58      0     10    125     25    105     13     34      4     49      0    107
     61     14     31     10     52     69      2      6     47     10      0    136     35    116     22     44      7     38     11    118
    198    122    167    141     84     67    138    136    183    125    136      0    100     24    118     91    129    174    125     21
     97     21     66     40     18     33     38     37     83     25     35    100      0     80     18     11     29     74     24     82
    177    102    147    120     66     46    118    117    163    105    116     24     80      0     96     73    109    154    105      4
     81     13     51     23     36     50     24     26     66     13     22    118     18     96      0     29     18     59     12     98
    106     30     75     51      7     27     47     44     92     34     44     91     11     73     29      0     37     82     33     74
     68      7     38     16     45     63      9      8     54      4      7    129     29    109     18     37      0     45      5    111
     23     52      7     36     90    108     36     38     12     49     38    174     74    154     59     82     45      0     49    156
     73      3     42     17     41     58     13     13     58      0     11    125     24    105     12     33      5     49      0    106
    179    103    149    122     67     48    120    118    165    107    118     21     82      4     98     74    111    156    106      0