# bench EOLE photo, generated by bep version 0.1, generation model "A"
bEpInstance_A_30_91
     30     91    100   1000     30     60     50    250    100    4.0
      1     59    566     30    466    666    171
      2     47    562     55    462    662    113
      3     76    666     39    566    766    188
      4     47    165     35     65    265    204
      5     98    987     30    887   1087    183
      6      1    613     41    513    713    187
      7     81    529     45    429    629     88
      8     31    937     43    837   1037    231
      9     50    450     45    350    550    245
     10      1    327     38    227    427    205
     11    100    608     44    508    708    143
     12     78    645     37    545    745    199
     13     63    256     42    156    356    179
     14     87    791     40    691    891    186
     15     32    813     56    713    913    177
     16     75    304     46    204    404    100
     17     76     48     36    -52    148    204
     18     37    510     46    410    610    124
     19     11      3     55    -97    103    229
     20     65     69     49    -31    169    106
     21     32     43     58    -57    143     89
     22     84    249     57    149    349     80
     23      6    739     54    639    839    213
     24      4    329     31    229    429    210
     25     38    289     47    189    389    201
     26     80    105     33      5    205    234
     27     10    955     55    855   1055    202
     28      2    443     31    343    543    120
     29     49    958     46    858   1058    114
     30     20    416     44    316    516    103
      0      3     25    100    105     18     10     93     29     61     14     20     77     56     62     65    129     15    141    124    130     79     45     60     69    115     98     33     98     38
      3      0     26     99    107     17     11     93     28     59     17     22     76     58     62     64    128     13    140    123    129     78     45     59     68    114     98     31     99     37
     25     26      0    125     80     22     34     68     54     86     15      5    102     31     38     90    154     40    166    149    156    104     25     86     94    140     74     58     73     64
    100     99    125      0    205    112     91    193     71     42    111    120     23    156    162     35     30     86     41     24     30     22    143     42     31     17    197     70    198     63
    105    107     80    205      0     96    114     20    134    166     94     85    182     49     46    170    234    120    246    229    236    184     66    166    175    220     23    138     14    144
     18     17     22    112     96      0     29     81     42     71     24     20     90     49     50     79    142     27    152    136    142     93     31     71     81    128     85     42     87     49
     10     11     34     91    114     29      0    102     21     54     20     29     68     65     72     56    120     11    132    115    122     70     55     53     60    106    107     29    107     32
     93     93     68    193     20     81    102      0    121    152     84     73    170     39     31    158    222    106    233    217    223    172     49    152    162    208      6    123      6    130
     29     28     54     71    134     42     21    121      0     33     41     49     48     85     90     37    100     15    112     95    101     50     73     32     40     86    126     12    127     11
     61     59     86     42    166     71     54    152     33      0     74     81     23    117    121     19     72     46     81     66     71     28    103      0     13     58    157     29    158     22
     14     17     15    111     94     24     20     84     41     74      0     10     88     45     53     76    140     29    152    135    142     89     40     73     81    125     89     47     88     52
     20     22      5    120     85     20     29     73     49     81     10      0     97     36     43     85    149     35    161    144    150     99     29     81     89    135     79     53     78     59
     77     76    102     23    182     90     68    170     48     23     88     97      0    133    139     12     52     63     64     46     53      5    121     23     10     37    175     49    175     41
     56     58     31    156     49     49     65     39     85    117     45     36    133      0     14    121    185     71    197    180    187    135     24    117    126    171     45     89     42     95
     62     62     38    162     46     50     72     31     90    121     53     43    139     14      0    127    191     75    202    186    192    141     19    121    131    177     35     92     36     99
     65     64     90     35    170     79     56    158     37     19     76     85     12    121    127      0     64     52     76     58     66     13    110     18      9     49    163     39    163     31
    129    128    154     30    234    142    120    222    100     72    140    149     52    185    191     64      0    115     19      5     11     50    173     72     60     14    227    100    227     93
     15     13     40     86    120     27     11    106     15     46     29     35     63     71     75     52    115      0    126    110    116     66     57     45     55    101    111     18    112     23
    141    140    166     41    246    152    132    233    112     81    152    161     64    197    202     76     19    126      0     21     11     64    184     81     71     30    238    110    238    103
    124    123    149     24    229    136    115    217     95     66    135    144     46    180    186     58      5    110     21      0     10     45    168     66     55      9    221     94    222     87
    130    129    156     30    236    142    122    223    101     71    142    150     53    187    192     66     11    116     11     10      0     53    174     71     61     19    228    100    228     93
     79     78    104     22    184     93     70    172     50     28     89     99      5    135    141     13     50     66     64     45     53      0    124     28     15     36    177     52    177     44
     45     45     25    143     66     31     55     49     73    103     40     29    121     24     19    110    173     57    184    168    174    124      0    102    112    159     54     74     55     80
     60     59     86     42    166     71     53    152     32      0     73     81     23    117    121     18     72     45     81     66     71     28    102      0     13     59    156     28    157     22
     69     68     94     31    175     81     60    162     40     13     81     89     10    126    131      9     60     55     71     55     61     15    112     13      0     47    166     39    167     32
    115    114    140     17    220    128    106    208     86     58    125    135     37    171    177     49     14    101     30      9     19     36    159     59     47      0    213     86    213     79
     98     98     74    197     23     85    107      6    126    157     89     79    175     45     35    163    227    111    238    221    228    177     54    156    166    213      0    128      9    134
     33     31     58     70    138     42     29    123     12     29     47     53     49     89     92     39    100     18    110     94    100     52     74     28     39     86    128      0    129      8
     98     99     73    198     14     87    107      6    127    158     88     78    175     42     36    163    227    112    238    222    228    177     55    157    167    213      9    129      0    135
     38     37     64     63    144     49     32    130     11     22     52     59     41     95     99     31     93     23    103     87     93     44     80     22     32     79    134      8    135      0