# bench EOLE photo, generated by bep version 0.1, generation model "A"
bEpInstance_A_15_70
     15     70    100   1000     30     60     50    250    100    4.0
      1     57    899     35    799    999    228
      2     36    935     37    835   1035     75
      3     36    899     49    799    999    210
      4     56    590     57    490    690     77
      5     67    454     44    354    554    106
      6      1    746     49    646    846    234
      7     51    488     33    388    588     73
      8     91    881     46    781    981    144
      9     78    703     41    603    803     78
     10     64    608     38    508    708    249
     11     51    902     54    802   1002     63
     12     49    671     36    571    771     83
     13     12    682     43    582    782     77
     14     43     91     31     -9    191    238
     15     58    163     31     63    263    146
      0     10      5     77    111     40    102      9     49     72      1     57     55    202    184
     10      0      9     86    120     48    111     19     58     82      9     66     63    211    193
      5      9      0     77    111     39    102     14     50     73      3     57     54    202    184
     77     86     77      0     34     41     25     73     28      4     78     20     25    124    106
    111    120    111     34      0     74      9    106     62     38    112     54     58     90     72
     40     48     39     41     74      0     65     40     22     37     40     22     16    164    146
    102    111    102     25      9     65      0     98     54     30    103     45     49     99     81
      9     19     14     73    106     40     98      0     44     68     11     53     53    197    179
     49     58     50     28     62     22     54     44      0     24     50     10     17    153    135
     72     82     73      4     38     37     30     68     24      0     73     16     22    129    111
      1      9      3     78    112     40    103     11     50     73      0     57     55    202    184
     57     66     57     20     54     22     45     53     10     16     57      0      9    145    127
     55     63     54     25     58     16     49     53     17     22     55      9      0    147    130
    202    211    202    124     90    164     99    197    153    129    202    145    147      0     18
    184    193    184    106     72    146     81    179    135    111    184    127    130     18      0