# bench EOLE photo, generated by bep version 0.1, generation model "A"
bEpInstance_A_25_62
     25     62    100   1000     30     60     50    250    100    4.0
      1     70    591     53    491    691    215
      2     38    167     56     67    267    203
      3     41    216     47    116    316     50
      4     85    669     43    569    769    140
      5     71    337     43    237    437    145
      6     43    303     30    203    403    239
      7     67    136     43     36    236     58
      8     64    360     48    260    460    118
      9     96    342     35    242    442    117
     10     51     18     33    -82    118    235
     11     23    651     58    551    751     65
     12     32    365     46    265    465     55
     13     70    957     45    857   1057     76
     14     26    512     32    412    612    236
     15     65    498     60    398    598    108
     16     86    566     49    466    666    212
     17     91    794     34    694    894    133
     18     82    243     40    143    343     59
     19     90    263     33    163    363     92
     20     63    653     37    553    753    116
     21     61    749     44    649    849    224
     22     26    535     54    435    635    232
     23      3    766     36    666    866    228
     24     33    829     51    729    929     98
     25     62    844     50    744    944    137
      0    106     94     19     63     72    113     57     62    143     19     57     91     22     23      7     51     87     82     15     39     17     46     60     63
    106      0     12    126     43     34     10     48     46     37    121     49    197     86     83    100    157     21     27    121    145     92    150    165    169
     94     12      0    113     31     21     21     36     34     49    108     37    185     74     70     88    145     12     16    109    133     79    137    153    157
     19    126    113      0     83     92    133     77     81    162     16     77     72     41     43     25     31    106    101      6     20     36     31     42     44
     63     43     31     83      0     11     50      6      6     79     79     12    155     45     40     57    114     23     19     79    103     50    108    123    126
     72     34     21     92     11      0     42     15     16     71     87     15    163     52     49     66    123     17     15     87    111     58    116    131    135
    113     10     21    133     50     42      0     56     52     29    129     57    205     94     90    107    164     27     32    129    153    100    158    173    177
     57     48     36     77      6     15     56      0      9     85     73      8    149     39     34     51    108     29     25     73     97     44    102    117    121
     62     46     34     81      6     16     52      9      0     81     79     17    153     45     39     56    113     24     19     78    102     51    108    122    125
    143     37     49    162     79     71     29     85     81      0    158     86    234    123    120    137    194     56     62    158    182    129    187    202    206
     19    121    108     16     79     87    129     73     79    158      0     71     77     34     39     26     39    103     98     10     26     29     29     44     49
     57     49     37     77     12     15     57      8     17     86     71      0    148     36     34     52    108     32     29     72     96     42    100    116    119
     91    197    185     72    155    163    205    149    153    234     77    148      0    111    114     97     41    178    173     76     52    106     50     33     28
     22     86     74     41     45     52     94     39     45    123     34     36    111      0     10     20     72     68     64     36     59      5     63     79     83
     23     83     70     43     40     49     90     34     39    120     39     34    114     10      0     17     74     63     59     38     62     13     68     83     86
      7    100     88     25     57     66    107     51     56    137     26     52     97     20     17      0     57     80     75     22     46     16     54     67     69
     51    157    145     31    114    123    164    108    113    194     39    108     41     72     74     57      0    137    132     35     13     66     23     16     14
     87     21     12    106     23     17     27     29     24     56    103     32    178     68     63     80    137      0      5    102    126     74    132    147    150
     82     27     16    101     19     15     32     25     19     62     98     29    173     64     59     75    132      5      0     97    121     69    127    142    145
     15    121    109      6     79     87    129     73     78    158     10     72     76     36     38     22     35    102     97      0     24     30     31     44     47
     39    145    133     20    103    111    153     97    102    182     26     96     52     59     62     46     13    126    121     24      0     54     15     21     23
     17     92     79     36     50     58    100     44     51    129     29     42    106      5     13     16     66     74     69     30     54      0     58     73     77
     46    150    137     31    108    116    158    102    108    187     29    100     50     63     68     54     23    132    127     31     15     58      0     17     24
     60    165    153     42    123    131    173    117    122    202     44    116     33     79     83     67     16    147    142     44     21     73     17      0      8
     63    169    157     44    126    135    177    121    125    206     49    119     28     83     86     69     14    150    145     47     23     77     24      8      0