# bench EOLE photo, generated by bep version 0.1, generation model "A"
bEpInstance_A_45_43
     45     43    100   1000     30     60     50    250    100    4.0
      1     39    241     45    141    341    199
      2     14    970     45    870   1070     81
      3     61    610     57    510    710    235
      4     72    185     32     85    285    194
      5     76    310     37    210    410    231
      6      4    523     34    423    623    227
      7     30     33     43    -67    133    215
      8     89    889     57    789    989    106
      9     13    380     30    280    480    103
     10     35    521     43    421    621    241
     11     13    298     57    198    398    220
     12     48    973     47    873   1073     99
     13     28    829     34    729    929    116
     14     35    304     36    204    404    181
     15     34    645     44    545    745     95
     16     53    364     45    264    464    183
     17     75    528     58    428    628     68
     18      4    357     31    257    457     85
     19     66    924     30    824   1024     78
     20     90    600     41    500    700     86
     21     43    534     45    434    634    206
     22     84    726     43    626    826     85
     23     37    908     42    808   1008    231
     24     27    907     47    807   1007     53
     25     43    500     33    400    600    147
     26     86    154     50     54    254    153
     27      7    691     50    591    791    245
     28     29     37     34    -63    137    194
     29     57    666     45    566    766    132
     30     39    929     48    829   1029    203
     31     84    989     50    889   1089     71
     32     90    234     33    134    334    116
     33     74    232     55    132    332    168
     34     39    474     33    374    574    143
     35     16    758     43    658    858    141
     36     80    596     35    496    696    123
     37     26    670     54    570    770    181
     38     60    365     42    265    465    137
     39     35     81     46    -19    181     99
     40     31    668     47    568    768     60
     41     90    391     49    291    491    107
     42     87    747     53    647    847     56
     43     50    194     45     94    294    110
     44     79    659     50    559    759     60
     45     33    446     51    346    546    236
      0    182     92     16     19     71     52    162     35     70     15    183    147     15    101     30     72     30    170     90     73    121    166    166     64     24    112     51    106    172    187     12      9     58    129     89    107     31     40    106     39    127     12    104     51
    182      0     90    196    165    111    234     27    147    112    168      8     35    166     81    151    111    153     17     94    109     63     16     16    117    204     69    233     76     12     18    184    185    124     53     94     75    151    222     75    145     58    194     79    131
     92     90      0    106     75     26    144     70     58     23     78     90     55     76     11     61     20     64     78      7     19     29     74     74     27    114     24    143     14     79     94     94     94     34     38      5     17     61    132     16     55     34    104     13     41
     16    196    106      0     31     86     39    176     50     84     31    197    161     31    115     45     85     46    184    103     87    135    180    180     79      8    127     38    120    186    201     13     11     72    143    102    121     45     27    121     51    140      5    118     65
     19    165     75     31      0     56     70    144     23     53     16    165    130     10     84     14     54     21    153     72     56    104    149    149     48     39     96     69     89    155    169     19     19     42    113     71     90     14     58     90     20    109     29     87     35
     71    111     26     86     56      0    122     93     35      7     56    113     76     55     31     41     17     41    101     28     10     54     96     96     11     94     42    121     38    101    118     75     74     15     58     26     37     41    110     36     39     59     83     38     20
     52    234    144     39     70    122      0    214     86    122     66    235    199     67    153     82    124     81    222    142    125    173    218    218    116     33    164      1    158    224    239     52     50    110    181    141    159     83     12    158     90    179     40    156    103
    162     27     70    176    144     93    214      0    128     92    148     23     21    146     62    131     90    134     10     72     89     40     13     16     97    183     53    213     56     16     25    163    164    104     37     73     56    131    202     57    124     35    174     57    111
     35    147     58     50     23     35     86    128      0     35     20    148    112     19     66     10     40      6    136     58     39     88    132    131     30     59     77     85     72    137    153     41     40     24     94     56     72     12     74     72     19     93     47     71     17
     70    112     23     84     53      7    122     92     35      0     56    113     77     54     31     39     10     41    101     24      3     52     96     96      5     92     43    121     36    102    117     73     72     11     59     21     37     39    110     36     35     57     81     36     18
     15    168     78     31     16     56     66    148     20     56      0    168    132      5     86     19     59     14    157     77     59    108    152    152     51     40     98     65     92    157    173     25     22     44    115     76     93     20     54     92     30    113     27     91     37
    183      8     90    197    165    113    235     23    148    113    168      0     36    167     82    152    111    154     13     93    109     62     16     17    118    204     71    234     76     11      9    185    185    124     54     94     75    152    223     76    145     57    194     78    131
    147     35     55    161    130     76    199     21    112     77    132     36      0    131     46    116     76    118     25     59     73     29     19     19     82    169     34    198     41     25     42    149    149     88     18     59     39    116    187     40    110     25    158     44     95
     15    166     76     31     10     55     67    146     19     54      5    167    131      0     85     15     56     15    155     75     57    106    151    150     49     39     97     66     90    156    171     22     20     42    113     73     91     16     55     91     25    111     27     89     35
    101     81     11    115     84     31    153     62     66     31     86     82     46     85      0     70     30     72     70     17     27     23     65     65     36    123     13    152      7     71     86    103    103     42     28     16      6     70    141      5     65     28    112     11     49
     30    151     61     45     14     41     82    131     10     39     19    152    116     15     70      0     41     12    140     59     42     90    136    135     34     53     82     81     75    141    156     33     33     27     98     58     76      1     70     76     11     96     42     74     21
     72    111     20     85     54     17    124     90     40     10     59    111     76     56     30     41      0     46     99     18      8     49     95     95     10     93     44    123     34    100    115     73     74     16     59     17     37     40    112     36     34     54     83     32     23
     30    153     64     46     21     41     81    134      6     41     14    154    118     15     72     12     46      0    142     64     45     94    137    137     37     54     83     80     78    143    159     37     35     30    100     62     78     14     69     78     23     99     42     77     23
    170     17     78    184    153    101    222     10    136    101    157     13     25    155     70    140     99    142      0     81     97     49      8     10    106    192     60    221     64      6     16    172    173    112     43     82     64    139    210     64    133     44    182     66    119
     90     94      7    103     72     28    142     72     58     24     77     93     59     75     17     59     18     64     81      0     20     31     78     78     27    111     30    141     18     83     97     91     92     33     43      2     23     59    130     22     52     36    101     15     41
     73    109     19     87     56     10    125     89     39      3     59    109     73     57     27     42      8     45     97     20      0     49     93     93      8     95     40    124     33     98    114     75     75     15     56     18     34     42    113     33     37     54     85     32     22
    121     63     29    135    104     54    173     40     88     52    108     62     29    106     23     90     49     94     49     31     49      0     46     47     57    143     21    172     16     51     65    123    123     63     18     32     20     90    161     19     83      5    133     16     71
    166     16     74    180    149     96    218     13    132     96    152     16     19    151     65    136     95    137      8     78     93     46      0      2    102    188     54    217     60      5     23    169    169    108     37     78     59    135    206     60    129     42    178     63    115
    166     16     74    180    149     96    218     16    131     96    152     17     19    150     65    135     95    137     10     78     93     47      2      0    101    188     54    217     60      6     24    168    169    108     37     78     59    135    206     59    129     42    178     63    115
     64    117     27     79     48     11    116     97     30      5     51    118     82     49     36     34     10     37    106     27      8     57    102    101      0     87     48    115     41    107    122     67     67      6     64     25     42     34    104     42     29     62     76     40     13
     24    204    114      8     39     94     33    183     59     92     40    204    169     39    123     53     93     54    192    111     95    143    188    188     87      0    135     32    128    194    208     20     19     80    152    110    129     53     22    129     59    148     13    126     74
    112     69     24    127     96     42    164     53     77     43     98     71     34     97     13     82     44     83     60     30     40     21     54     54     48    135      0    163     13     60     76    116    115     54     16     29      7     82    152      8     77     24    124     19     61
     51    233    143     38     69    121      1    213     85    121     65    234    198     66    152     81    123     80    221    141    124    172    217    217    115     32    163      0    157    223    238     51     50    109    180    140    158     82     11    157     89    178     39    156    102
    106     76     14    120     89     38    158     56     72     36     92     76     41     90      7     75     34     78     64     18     33     16     60     60     41    128     13    157      0     65     81    108    108     48     25     18      7     75    146      6     69     21    118      5     55
    172     12     79    186    155    101    224     16    137    102    157     11     25    156     71    141    100    143      6     83     98     51      5      6    107    194     60    223     65      0     18    174    174    113     43     83     64    141    212     65    135     47    183     68    120
    187     18     94    201    169    118    239     25    153    117    173      9     42    171     86    156    115    159     16     97    114     65     23     24    122    208     76    238     81     18      0    188    189    129     60     98     81    156    227     81    149     60    198     82    136
     12    184     94     13     19     75     52    163     41     73     25    185    149     22    103     33     73     37    172     91     75    123    169    168     67     20    116     51    108    174    188      0      4     61    132     90    110     33     40    109     39    128     14    106     54
      9    185     94     11     19     74     50    164     40     72     22    185    149     20    103     33     74     35    173     92     75    123    169    169     67     19    115     50    108    174    189      4      0     61    132     91    110     33     38    109     39    128     11    106     54
     58    124     34     72     42     15    110    104     24     11     44    124     88     42     42     27     16     30    112     33     15     63    108    108      6     80     54    109     48    113    129     61     61      0     71     32     49     27     98     48     24     69     70     47      7
    129     53     38    143    113     58    181     37     94     59    115     54     18    113     28     98     59    100     43     43     56     18     37     37     64    152     16    180     25     43     60    132    132     71      0     43     22     98    169     22     93     17    141     29     78
     89     94      5    102     71     26    141     73     56     21     76     94     59     73     16     58     17     62     82      2     18     32     78     78     25    110     29    140     18     83     98     90     91     32     43      0     22     57    129     21     51     37    100     15     39
    107     75     17    121     90     37    159     56     72     37     93     75     39     91      6     76     37     78     64     23     34     20     59     59     42    129      7    158      7     64     81    110    110     49     22     22      0     76    147      1     71     24    119     13     56
     31    151     61     45     14     41     83    131     12     39     20    152    116     16     70      1     40     14    139     59     42     90    135    135     34     53     82     82     75    141    156     33     33     27     98     57     76      0     71     76      9     95     42     73     21
     40    222    132     27     58    110     12    202     74    110     54    223    187     55    141     70    112     69    210    130    113    161    206    206    104     22    152     11    146    212    227     40     38     98    169    129    147     71      0    146     78    167     28    144     91
    106     75     16    121     90     36    158     57     72     36     92     76     40     91      5     76     36     78     64     22     33     19     60     59     42    129      8    157      6     65     81    109    109     48     22     21      1     76    146      0     70     24    118     12     55
     39    145     55     51     20     39     90    124     19     35     30    145    110     25     65     11     34     23    133     52     37     83    129    129     29     59     77     89     69    135    149     39     39     24     93     51     71      9     78     70      0     89     50     67     19
    127     58     34    140    109     59    179     35     93     57    113     57     25    111     28     96     54     99     44     36     54      5     42     42     62    148     24    178     21     47     60    128    128     69     17     37     24     95    167     24     89      0    138     22     76
     12    194    104      5     29     83     40    174     47     81     27    194    158     27    112     42     83     42    182    101     85    133    178    178     76     13    124     39    118    183    198     14     11     70    141    100    119     42     28    118     50    138      0    116     63
    104     79     13    118     87     38    156     57     71     36     91     78     44     89     11     74     32     77     66     15     32     16     63     63     40    126     19    156      5     68     82    106    106     47     29     15     13     73    144     12     67     22    116      0     54
     51    131     41     65     35     20    103    111     17     18     37    131     95     35     49     21     23     23    119     41     22     71    115    115     13     74     61    102     55    120    136     54     54      7     78     39     56     21     91     55     19     76     63     54      0