# bench EOLE photo, generated by bep version 0.1, generation model "A"
bEpInstance_A_25_16
     25     16    100   1000     30     60     50    250    100    4.0
      1     21     89     39    -11    189    170
      2     93      8     37    -92    108    189
      3     36    823     33    723    923    161
      4     38    288     55    188    388    112
      5     86    679     31    579    779     56
      6      9    305     35    205    405    123
      7     10    590     38    490    690     58
      8     89    921     53    821   1021     70
      9      1     73     51    -27    173    237
     10      8    951     49    851   1051    138
     11     78    742     60    642    842     81
     12      3    819     44    719    919    228
     13     50    506     58    406    606    169
     14     81    100     59      0    200    233
     15     69    234     59    134    334    165
     16     15    703     50    603    803     83
     17     78    377     32    277    477    222
     18     33    719     39    619    819     70
     19     46    291     38    191    391    148
     20     11    726     41    626    826    172
     21     23    300     36    200    400     58
     22     40    165     59     65    265     67
     23     40    904     50    804   1004    161
     24     61    341     52    241    441    126
     25     72    813     37    713    913     59
      0     27    183     49    148     54    125    208      6    215    163    182    104     15     38    153     73    157     50    159     52     19    203     63    181
     27      0    204     71    167     77    146    228     28    236    183    203    124     23     56    174     92    178     71    180     75     41    224     83    201
    183    204      0    133     38    129     58     27    187     32     22      8     79    181    147     30    111     26    133     25    130    164     20    120      9
     49     71    133      0     98      8     75    158     54    165    113    133     54     48     15    103     24    107      2    109      4     30    154     14    131
    148    167     38     98      0     95     29     60    152     70     15     40     44    144    111     18     75     16     97     22     96    129     57     84     33
     54     77    129      8     95      0     71    155     58    161    110    128     51     54     23     99     24    103      9    105      3     35    149     15    127
    125    146     58     75     29     71      0     85    129     90     41     57     23    123     90     28     55     32     75     34     72    106     78     63     57
    208    228     27    158     60    155     85      0    213     21     44     33    104    205    171     57    136     52    157     52    156    189     12    145     27
      6     28    187     54    152     58    129    213      0    219    168    186    108     21     43    157     78    161     55    163     57     24    207     68    185
    215    236     32    165     70    161     90     21    219      0     55     33    111    213    179     62    144     58    165     56    162    196     14    153     38
    163    183     22    113     15    110     41     44    168     55      0     26     59    160    127     18     91     12    113     17    111    144     41    100     17
    182    203      8    133     40    128     57     33    186     33     26      0     79    180    147     29    112     26    132     23    129    163     23    120     17
    104    124     79     54     44     51     23    104    108    111     59     79      0    101     68     50     33     53     53     55     51     85     99     41     76
     15     23    181     48    144     54    123    205     21    213    160    180    101      0     33    151     69    155     48    157     52     19    201     60    178
     38     56    147     15    111     23     90    171     43    179    127    147     68     33      0    118     35    121     15    123     20     18    167     26    144
    153    174     30    103     18     99     28     57    157     62     18     29     50    151    118      0     83      6    103      5    100    134     50     91     30
     73     92    111     24     75     24     55    136     78    144     91    112     33     69     35     83      0     86     22     88     23     53    132      9    109
    157    178     26    107     16    103     32     52    161     58     12     26     53    155    121      6     86      0    107      5    104    138     46     94     25
     50     71    133      2     97      9     75    157     55    165    113    132     53     48     15    103     22    107      0    109      6     31    153     13    130
    159    180     25    109     22    105     34     52    163     56     17     23     55    157    123      5     88      5    109      0    106    140     45     97     26
     52     75    130      4     96      3     72    156     57    162    111    129     51     52     20    100     23    104      6    106      0     34    151     13    128
     19     41    164     30    129     35    106    189     24    196    144    163     85     19     18    134     53    138     31    140     34      0    184     44    162
    203    224     20    154     57    149     78     12    207     14     41     23     99    201    167     50    132     46    153     45    151    184      0    140     24
     63     83    120     14     84     15     63    145     68    153    100    120     41     60     26     91      9     94     13     97     13     44    140      0    118
    181    201      9    131     33    127     57     27    185     38     17     17     76    178    144     30    109     25    130     26    128    162     24    118      0