# bench EOLE photo, generated by bep version 0.1, generation model "A"
bEpInstance_A_40_53
     40     53    100   1000     30     60     50    250    100    4.0
      1     98    874     46    774    974    139
      2     99    178     48     78    278    172
      3     66    960     60    860   1060     59
      4     74    708     45    608    808    214
      5      8    957     36    857   1057    156
      6     78    571     51    471    671     70
      7     10    335     31    235    435    107
      8     32     34     47    -66    134    110
      9     91     77     53    -23    177    228
     10     25    358     45    258    458    234
     11     32    470     59    370    570     60
     12     17    476     57    376    576    102
     13     43     68     54    -32    168     91
     14     64    480     39    380    580    199
     15     82    343     30    243    443     77
     16     38    587     43    487    687    107
     17     67    188     35     88    288    234
     18     55    677     55    577    777    223
     19     14    800     58    700    900    115
     20     27    790     48    690    890    192
     21     86    374     58    274    474    149
     22     86    225     37    125    325    184
     23     57    271     55    171    371    240
     24     86    249     37    149    349    155
     25     44    409     43    309    509    247
     26      8    279     56    179    379     96
     27      7    763     47    663    863    121
     28     55    143     31     43    243    132
     29     52    978     58    878   1078    124
     30     20    148     31     48    248    204
     31     42    849     52    749    949    105
     32      9    949     54    849   1049    157
     33     36    242     46    142    342    139
     34     52    363     50    263    463    170
     35     12    232     59    132    332    186
     36     37     13     32    -87    113    229
     37    100    997     38    897   1097     88
     38     14    304     59    204    404    163
     39     15    680     56    580    780    100
     40     63    641     54    541    741    248
      0    174     22     41     30     75    136    210    199    130    102    101    201     98    132     73    171     50     27     27    125    162    151    156    117    150     35    183     28    182     15     29    158    128    161    215     30    144     52     58
    174      0    195    132    196     98     45     39     25     48     74     77     30     76     41    103      8    125    156    154     49     12     25     18     59     33    148     14    200     21    168    194     22     47     25     44    204     37    127    116
     22    195      0     63     14     97    156    231    220    150    122    121    223    120    154     93    193     70     42     43    146    183    172    177    137    170     51    204      5    203     28     14    179    149    182    236     12    164     71     79
     41    132     63      0     64     34     94    168    157     88     60     59    160     57     91     31    130      9     27     23     83    120    109    114     75    108     21    141     67    140     36     62    116     86    120    173     72    102     16     16
     30    196     14     64      0     98    155    230    220    149    121    120    222    120    154     92    192     70     39     42    147    184    171    178    137    169     48    203     12    202     28      2    178    148    181    236     25    163     69     80
     75     98     97     34     98      0     61    134    123     54     27     28    126     23     57     10     95     27     59     56     49     86     75     80     41     75     51    107    101    106     70     96     82     52     86    139    106     68     31     17
    136     45    156     94    155     61      0     75     67      6     34     35     67     38     18     63     39     86    116    113     21     33     19     28     20     14    107     49    161     46    128    153     24     12     25     80    167      7     86     77
    210     39    231    168    230    134     75      0     18     81    109    110      8    111     78    138     39    160    191    189     86     49     59     55     93     61    182     27    236     28    203    228     52     82     49      5    241     67    161    151
    199     25    220    157    220    123     67     18      0     72     99    101     12    100     66    128     28    150    181    178     74     37     49     43     83     54    172     18    225     25    193    218     43     72     43     20    230     59    151    141
    130     48    150     88    149     54      6     81     72      0     28     29     72     32     14     57     43     80    110    108     15     36     23     31     13     20    101     54    155     52    122    147     29      6     31     86    160     13     80     71
    102     74    122     60    121     27     34    109     99     28      0      4    100      8     34     29     71     52     82     80     27     62     50     56     15     48     73     81    127     80     94    119     57     27     59    114    132     41     52     43
    101     77    121     59    120     28     35    110    101     29      4      0    102     11     37     28     73     51     81     78     30     65     52     59     18     49     71     83    125     82     93    118     58     29     61    115    131     43     51     42
    201     30    223    160    222    126     67      8     12     72    100    102      0    103     69    129     30    152    183    180     77     40     50     46     85     53    173     18    227     20    195    220     43     73     41     13    232     59    153    143
     98     76    120     57    120     23     38    111    100     32      8     11    103      0     34     27     73     49     80     78     27     63     52     58     18     52     72     84    124     83     92    118     59     29     63    116    129     45     51     40
    132     41    154     91    154     57     18     78     66     14     34     37     69     34      0     61     38     83    115    112      7     29     19     23     19     24    106     50    158     51    126    152     27      9     32     83    163     19     85     74
     73    103     93     31     92     10     63    138    128     57     29     28    129     27     61      0    100     22     53     50     54     91     79     85     44     77     44    111     97    109     65     90     86     56     88    143    103     71     23     14
    171      8    193    130    192     95     39     39     28     43     71     73     30     73     38    100      0    122    153    150     46     10     20     15     55     27    144     11    197     15    165    190     15     43     17     44    202     31    123    113
     50    125     70      9     70     27     86    160    150     80     52     51    152     49     83     22    122      0     32     29     76    113    101    107     67    100     24    133     75    132     43     68    108     78    111    166     80     93     10      9
     27    156     42     27     39     59    116    191    181    110     82     81    183     80    115     53    153     32      0      4    108    144    132    138     98    130      9    164     45    163     14     37    139    109    142    196     53    124     30     41
     27    154     43     23     42     56    113    189    178    108     80     78    180     78    112     50    150     29      4      0    105    142    129    136     95    127      8    161     47    160     15     40    137    106    139    194     54    121     27     38
    125     49    146     83    147     49     21     86     74     15     27     30     77     27      7     54     46     76    108    105      0     37     26     31     13     30     99     58    151     58    119    145     35      8     40     91    155     25     78     66
    162     12    183    120    184     86     33     49     37     36     62     65     40     63     29     91     10    113    144    142     37      0     13      6     47     23    135     21    188     25    156    182     13     35     18     54    193     26    115    104
    151     25    172    109    171     75     19     59     49     23     50     52     50     52     19     79     20    101    132    129     26     13      0      9     34     12    123     32    176     32    144    169      8     23     14     64    181     13    102     92
    156     18    177    114    178     80     28     55     43     31     56     59     46     58     23     85     15    107    138    136     31      6      9      0     41     20    130     27    182     30    150    176     12     29     18     60    187     22    109     98
    117     59    137     75    137     41     20     93     83     13     15     18     85     18     19     44     55     67     98     95     13     47     34     41      0     33     88     66    142     65    110    135     41     11     44     99    147     27     68     58
    150     33    170    108    169     75     14     61     54     20     48     49     53     52     24     77     27    100    130    127     30     23     12     20     33      0    121     35    175     32    142    167     11     23     11     66    180      6    100     91
     35    148     51     21     48     51    107    182    172    101     73     71    173     72    106     44    144     24      9      8     99    135    123    130     88    121      0    155     54    153     23     46    130    100    132    187     62    114     20     33
    183     14    204    141    203    107     49     27     18     54     81     83     18     84     50    111     11    133    164    161     58     21     32     27     66     35    155      0    208      8    176    201     25     55     24     32    213     41    134    124
     28    200      5     67     12    101    161    236    225    155    127    125    227    124    158     97    197     75     45     47    151    188    176    182    142    175     54    208      0    207     32     12    184    153    186    241     12    168     75     84
    182     21    203    140    202    106     46     28     25     52     80     82     20     83     51    109     15    132    163    160     58     25     32     30     65     32    153      8    207      0    175    200     23     54     21     34    213     39    133    123
     15    168     28     36     28     70    128    203    193    122     94     93    195     92    126     65    165     43     14     15    119    156    144    150    110    142     23    176     32    175      0     26    151    121    154    209     39    136     42     52
     29    194     14     62      2     96    153    228    218    147    119    118    220    118    152     90    190     68     37     40    145    182    169    176    135    167     46    201     12    200     26      0    176    146    179    234     25    161     67     78
    158     22    179    116    178     82     24     52     43     29     57     58     43     59     27     86     15    108    139    137     35     13      8     12     41     11    130     25    184     23    151    176      0     30      6     57    189     16    109     99
    128     47    149     86    148     52     12     82     72      6     27     29     73     29      9     56     43     78    109    106      8     35     23     29     11     23    100     55    153     54    121    146     30      0     34     87    158     17     79     69
    161     25    182    120    181     86     25     49     43     31     59     61     41     63     32     88     17    111    142    139     40     18     14     18     44     11    132     24    186     21    154    179      6     34      0     55    192     18    112    103
    215     44    236    173    236    139     80      5     20     86    114    115     13    116     83    143     44    166    196    194     91     54     64     60     99     66    187     32    241     34    209    234     57     87     55      0    246     72    166    157
     30    204     12     72     25    106    167    241    230    160    132    131    232    129    163    103    202     80     53     54    155    193    181    187    147    180     62    213     12    213     39     25    189    158    192    246      0    174     82     89
    144     37    164    102    163     68      7     67     59     13     41     43     59     45     19     71     31     93    124    121     25     26     13     22     27      6    114     41    168     39    136    161     16     17     18     72    174      0     94     85
     52    127     71     16     69     31     86    161    151     80     52     51    153     51     85     23    123     10     30     27     78    115    102    109     68    100     20    134     75    133     42     67    109     79    112    166     82     94      0     15
     58    116     79     16     80     17     77    151    141     71     43     42    143     40     74     14    113      9     41     38     66    104     92     98     58     91     33    124     84    123     52     78     99     69    103    157     89     85     15      0