# bench EOLE photo, generated by bep version 0.1, generation model "A"
bEpInstance_A_15_99
     15     99    100   1000     30     60     50    250    100    4.0
      1     46    875     59    775    975    184
      2     44    837     36    737    937    186
      3     21    850     58    750    950    249
      4     19     85     33    -15    185    242
      5     43    115     32     15    215    144
      6     10    564     45    464    664     84
      7     16    877     35    777    977    106
      8      7    974     42    874   1074    156
      9     85    339     36    239    439    108
     10     17    413     60    313    513    128
     11     26    876     41    776    976    141
     12     97    512     42    412    612    128
     13     63    492     56    392    592    197
     14      5    376     58    276    476     94
     15     25     94     45     -6    194    115
      0      9      8    197    190     78      7     26    134    115      5     91     95    125    195
      9      0      6    188    180     68     12     35    124    106     10     82     86    115    185
      8      6      0    191    183     71      6     31    128    109      6     86     90    118    189
    197    188    191      0      9    119    198    222     65     82    197    108    102     72      2
    190    180    183      9      0    112    190    214     56     74    190    100     94     65      6
     78     68     71    119    112      0     78    102     59     37     78     25     22     47    117
      7     12      6    198    190     78      0     24    135    116      2     93     96    125    195
     26     35     31    222    214    102     24      0    159    140     24    117    121    149    220
    134    124    128     65     56     59    135    159      0     25    135     43     38     22     63
    115    106    109     82     74     37    116    140     25      0    115     31     22      9     79
      5     10      6    197    190     78      2     24    135    115      0     92     96    125    195
     91     82     86    108    100     25     93    117     43     31     92      0      9     41    106
     95     86     90    102     94     22     96    121     38     22     96      9      0     32     99
    125    115    118     72     65     47    125    149     22      9    125     41     32      0     70
    195    185    189      2      6    117    195    220     63     79    195    106     99     70      0