# bench EOLE photo, generated by bep version 0.1, generation model "A"
bEpInstance_A_35_11
     35     11    100   1000     30     60     50    250    100    4.0
      1     93    527     39    427    627    150
      2     76    406     43    306    506     94
      3     84    404     32    304    504     99
      4     38     35     41    -65    135    153
      5     96    361     47    261    461    197
      6     24    791     35    691    891     53
      7     46    705     52    605    805     64
      8     44    860     35    760    960    123
      9     39    491     56    391    591     78
     10     90    314     41    214    414    196
     11     72    436     60    336    536     70
     12     47    346     49    246    446    136
     13     71    195     34     95    295    240
     14     99    335     59    235    435    139
     15      3    696     46    596    796    145
     16     56    698     56    598    798    239
     17     19    706     32    606    806     67
     18      2    444     55    344    544    198
     19     88    793     55    693    893    120
     20     14    455     54    355    555    220
     21     65    942     54    842   1042    178
     22     27    761     32    661    861    113
     23     46    601     54    501    701     52
     24     30    633     59    533    733    148
     25     34     36     47    -64    136    122
     26     48    388     33    288    488    122
     27     18    936     52    836   1036    114
     28     39    493     35    393    593     58
     29     43    964     51    864   1064    193
     30     73    762     30    662    862     86
     31     36    822     35    722    922    182
     32     45    146     34     46    246    209
     33     18    722     34    622    822    183
     34     11    250     30    150    350    108
     35     18    735     49    635    835    165
      0     30     30    123     41     68     46     84     16     53     23     46     83     48     47     43     48     30     66     26    103     60     21     30    123     36    103     15    109     58     75     96     52     72     55
     30      0      2     93     12     97     75    113     23     23      7     16     52     18     74     73     76     20     96     19    134     89     49     57     93      8    133     23    139     89    104     65     80     42     83
     30      2      0     92     11     97     75    114     24     22      8     17     52     17     75     73     77     22     97     21    134     90     50     58     92      9    134     24    140     89    105     65     81     42     84
    123     93     92      0     82    189    167    206    114     70    100     77     40     76    165    165    167    102    189    105    226    181    141    149      1     88    225    114    232    181    196     27    171     54    175
     41     12     11     82      0    108     86    125     35     11     19     12     41      6     86     84     88     31    108     31    145    101     61     69     82     13    145     35    151    100    116     55     92     34     95
     68     97     97    189    108      0     22     17     75    120     89    111    149    115     24     24     21     86     16     84     39      7     47     39    188    100     36     74     43     14      8    161     17    135     14
     46     75     75    167     86     22      0     38     53     98     67     89    127     93     10      3      6     66     24     63     59     14     26     18    167     79     58     53     64     15     29    139      8    114     10
     84    113    114    206    125     17     38      0     92    136    106    128    166    131     42     40     39    104     20    101     21     25     64     56    206    118     20     91     26     25      9    178     35    152     31
     16     23     24    114     35     75     53     92      0     46     16     36     74     41     52     51     53     14     76     10    112     67     27     35    113     25    111      0    118     68     82     86     57     60     61
     53     23     22     70     11    120     98    136     46      0     30     13     30      5     97     96     99     39    119     40    157    112     72     81     70     21    156     46    162    112    127     43    103     25    106
     23      7      8    100     19     89     67    106     16     30      0     23     60     26     67     65     68     17     89     15    126     82     41     50    100     13    125     16    132     81     96     72     72     48     75
     46     16     17     77     12    111     89    128     36     13     23      0     38     13     88     88     90     26    112     28    149    103     63     71     77     10    147     36    154    104    119     50     94     25     97
     83     52     52     40     41    149    127    166     74     30     60     38      0     35    126    125    128     64    149     66    186    141    101    109     40     48    185     74    192    141    156     13    132     20    135
     48     18     17     76      6    115     93    131     41      5     26     13     35      0     93     91     94     36    114     36    151    108     67     76     76     18    151     42    157    106    122     49     98     30    102
     47     74     75    165     86     24     10     42     52     97     67     88    126     93      0     13      4     63     32     60     63     17     26     17    165     77     60     51     67     24     32    137      7    111     10
     43     73     73    165     84     24      3     40     51     96     65     88    125     91     13      0      9     64     25     61     61     17     24     17    165     77     60     51     66     16     31    138     11    112     13
     48     76     77    167     88     21      6     39     53     99     68     90    128     94      4      9      0     65     27     62     60     13     27     18    167     79     57     53     64     19     29    140      4    114      7
     30     20     22    102     31     86     66    104     14     39     17     26     64     36     63     64     65      0     89      4    125     79     40     47    102     18    123     15    130     81     94     75     69     48     72
     66     96     97    189    108     16     24     20     76    119     89    112    149    114     32     25     27     89      0     86     37     17     49     42    189    101     39     75     44      8     14    162     24    137     22
     26     19     21    105     31     84     63    101     10     40     15     28     66     36     60     61     62      4     86      0    122     76     37     44    104     18    120     11    127     78     91     77     66     51     70
    103    134    134    226    145     39     59     21    112    157    126    149    186    151     63     61     60    125     37    122      0     46     85     77    226    138     11    112      7     45     30    199     56    173     53
     60     89     90    181    101      7     14     25     67    112     82    103    141    108     17     17     13     79     17     76     46      0     40     32    181     93     43     67     50     11     15    153     10    127      6
     21     49     50    141     61     47     26     64     27     72     41     63    101     67     26     24     27     40     49     37     85     40      0      8    141     53     84     27     90     40     55    113     31     88     34
     30     57     58    149     69     39     18     56     35     81     50     71    109     76     17     17     18     47     42     44     77     32      8      0    149     61     75     35     82     33     47    121     22     95     25
    123     93     92      1     82    188    167    206    113     70    100     77     40     76    165    165    167    102    189    104    226    181    141    149      0     88    225    114    232    181    196     27    171     53    174
     36      8      9     88     13    100     79    118     25     21     13     10     48     18     77     77     79     18    101     18    138     93     53     61     88      0    137     26    144     93    108     60     83     35     87
    103    133    134    225    145     36     58     20    111    156    125    147    185    151     60     60     57    123     39    120     11     43     84     75    225    137      0    110      9     45     28    197     53    171     50
     15     23     24    114     35     74     53     91      0     46     16     36     74     42     51     51     53     15     75     11    112     67     27     35    114     26    110      0    117     67     82     86     57     61     60
    109    139    140    232    151     43     64     26    118    162    132    154    192    157     67     66     64    130     44    127      7     50     90     82    232    144      9    117      0     51     35    204     60    178     57
     58     89     89    181    100     14     15     25     68    112     81    104    141    106     24     16     19     81      8     78     45     11     40     33    181     93     45     67     51      0     17    154     17    128     15
     75    104    105    196    116      8     29      9     82    127     96    119    156    122     32     31     29     94     14     91     30     15     55     47    196    108     28     82     35     17      0    169     25    143     22
     96     65     65     27     55    161    139    178     86     43     72     50     13     49    137    138    140     75    162     77    199    153    113    121     27     60    197     86    204    154    169      0    144     27    147
     52     80     81    171     92     17      8     35     57    103     72     94    132     98      7     11      4     69     24     66     56     10     31     22    171     83     53     57     60     17     25    144      0    118      3
     72     42     42     54     34    135    114    152     60     25     48     25     20     30    111    112    114     48    137     51    173    127     88     95     53     35    171     61    178    128    143     27    118      0    121
     55     83     84    175     95     14     10     31     61    106     75     97    135    102     10     13      7     72     22     70     53      6     34     25    174     87     50     60     57     15     22    147      3    121      0