# bench EOLE photo, generated by bep version 0.1, generation model "A"
bEpInstance_A_40_77
     40     77    100   1000     30     60     50    250    100    4.0
      1      7    288     54    188    388    175
      2     90    480     38    380    580    188
      3    100    488     51    388    588    237
      4     87    948     55    848   1048    120
      5     44    304     40    204    404    232
      6     52    872     47    772    972     52
      7     62    833     47    733    933    247
      8      3    574     56    474    674     72
      9     87    632     52    532    732    202
     10     11     11     43    -89    111     71
     11     50    144     31     44    244    123
     12      9    858     52    758    958    156
     13     16     43     43    -57    143    186
     14     92    994     51    894   1094    157
     15     83    269     45    169    369    223
     16     85    361     60    261    461    191
     17    100    716     44    616    816     70
     18     73    912     36    812   1012     95
     19      5    254     48    154    354     79
     20     11    305     51    205    405    105
     21     35    118     59     18    218    103
     22     11    648     54    548    748    238
     23     92    311     54    211    411    202
     24     67    777     44    677    877    183
     25     49    927     53    827   1027     94
     26     84    981     43    881   1081    229
     27     23     41     31    -59    141    119
     28     35    724     49    624    824    189
     29     85    576     59    476    676    241
     30     22    759     57    659    859     78
     31      7    692     57    592    792    199
     32     47    364     42    264    464    243
     33     29    175     35     75    275     76
     34     15    633     30    533    733    128
     35     68     69     52    -31    169     54
     36     80    360     52    260    460    177
     37     94    679     48    579    779     82
     38     44    481     39    381    581    152
     39     17    200     37    100    300    179
     40     57    658     48    558    758    221
      0     52     55    166     10    146    136     71     88     69     37    142     61    177     19     26    109    156      8      4     43     90     22    123    160    174     61    109     74    117    101     21     28     86     56     25    100     49     22     93
     52      0      3    117     45     98     88     32     38    118     84     96    110    128     52     29     59    108     60     48     91     46     42     74    112    125    111     62     24     71     56     30     77     42    102     30     49     11     72     45
     55      3      0    115     48     96     86     32     36    121     86     95    113    126     54     31     57    106     63     50     93     45     44     72    110    123    113     61     22     70     56     33     80     42    105     32     47     14     74     43
    166    117    115      0    161     20     29     95     79    235    201     29    226     11    169    146     58      9    174    161    207     77    159     43     10      8    227     57     93     49     67    146    193     80    219    147     67    117    187     72
     10     45     48    161      0    142    132     68     82     73     40    138     65    172     13     17    103    152     15      8     46     86     12    118    155    169     65    105     68    113     97     15     32     82     59     16     94     44     26     88
    146     98     96     20    142      0     10     75     60    215    182     11    207     32    150    128     40     11    154    142    188     56    140     24     13     28    207     37     74     29     46    127    174     60    200    128     49     97    168     53
    136     88     86     29    132     10      0     66     50    205    172     14    197     40    141    118     30     19    145    132    178     47    130     14     23     37    198     28     64     21     37    117    164     51    191    118     39     88    158     43
     71     32     32     95     68     75     66      0     25    140    108     71    132    107     78     57     42     86     80     67    114     18     69     53     88    103    133     38     20     46     29     53     99     15    127     56     34     25     93     24
     88     38     36     79     82     60     50     25      0    156    122     59    148     90     90     67     21     70     96     83    129     19     80     36     74     87    148     26     14     35     25     67    115     18    140     68     11     39    109      9
     69    118    121    235     73    215    205    140    156      0     34    211      8    246     66     89    177    225     60     73     27    159     77    192    229    243      8    178    142    187    170     88     41    155     20     88    168    117     47    162
     37     84     86    201     40    182    172    108    122     34      0    178     26    212     32     54    143    192     29     41      7    126     43    158    195    209     26    145    108    153    137     55      9    122     19     54    134     84     16    128
    142     96     95     29    138     11     14     71     59    211    178      0    203     39    148    125     42     20    151    138    185     52    138     24     19     36    204     34     73     24     41    123    170     56    197    125     49     94    164     51
     61    110    113    226     65    207    197    132    148      8     26    203      0    238     58     81    169    217     52     65     19    151     69    183    221    235      1    170    134    179    162     80     33    147     14     80    160    109     39    154
    177    128    126     11    172     32     40    107     90    246    212     39    238      0    181    158     69     21    186    173    219     88    170     54     19      3    238     68    104     61     78    157    205     92    231    158     78    128    199     84
     19     52     54    169     13    150    141     78     90     66     32    148     58    181      0     23    111    160     19     20     39     96     10    127    164    178     58    114     76    123    107     25     27     92     50     22    102     53     23     97
     26     29     31    146     17    128    118     57     67     89     54    125     81    158     23      0     88    137     33     23     62     74     12    104    141    155     81     91     53    100     85      9     48     70     73      1     79     31     43     74
    109     59     57     58    103     40     30     42     21    177    143     42    169     69    111     88      0     49    117    105    150     28    101     17     54     66    169     16     35     22     24     88    136     29    161     89      9     60    130     18
    156    108    106      9    152     11     19     86     70    225    192     20    217     21    160    137     49      0    165    152    198     67    150     33      7     17    218     47     84     40     57    137    184     71    210    138     58    107    178     63
      8     60     63    174     15    154    145     80     96     60     29    151     52    186     19     33    117    165      0     12     34     98     26    131    168    182     53    117     82    126    109     29     20     94     48     32    108     57     13    101
      4     48     50    161      8    142    132     67     83     73     41    138     65    173     20     23    105    152     12      0     47     85     20    118    155    169     66    104     70    113     96     17     32     82     60     22     95     44     26     88
     43     91     93    207     46    188    178    114    129     27      7    185     19    219     39     62    150    198     34     47      0    132     50    164    202    216     19    151    115    160    143     61     14    128     14     61    141     90     20    135
     90     46     45     77     86     56     47     18     19    159    126     52    151     88     96     74     28     67     98     85    132      0     86     35     70     85    151     19     25     27     11     71    118      3    145     74     22     42    112     11
     22     42     44    159     12    140    130     69     80     77     43    138     69    170     10     12    101    150     26     20     50     86      0    116    154    167     69    104     66    113     97     17     37     82     60     12     92     44     33     87
    123     74     72     43    118     24     14     53     36    192    158     24    183     54    127    104     17     33    131    118    164     35    116      0     37     51    184     15     50     12     26    103    150     38    177    104     25     74    144     29
    160    112    110     10    155     13     23     88     74    229    195     19    221     19    164    141     54      7    168    155    202     70    154     37      0     16    221     50     88     42     59    140    188     73    214    141     63    111    181     67
    174    125    123      8    169     28     37    103     87    243    209     36    235      3    178    155     66     17    182    169    216     85    167     51     16      0    235     65    101     57     74    154    201     88    228    155     75    125    195     81
     61    111    113    227     65    207    198    133    148      8     26    204      1    238     58     81    169    218     53     66     19    151     69    184    221    235      0    170    134    179    162     80     33    148     13     81    160    110     39    154
    109     62     61     57    105     37     28     38     26    178    145     34    170     68    114     91     16     47    117    104    151     19    104     15     50     65    170      0     39      9     10     90    137     23    163     91     18     60    131     17
     74     24     22     93     68     74     64     20     14    142    108     73    134    104     76     53     35     84     82     70    115     25     66     50     88    101    134     39      0     48     34     53    101     22    126     54     25     25     95     21
    117     71     70     49    113     29     21     46     35    187    153     24    179     61    123    100     22     40    126    113    160     27    113     12     42     57    179      9     48      0     17     98    146     31    172    100     26     69    139     26
    101     56     56     67     97     46     37     29     25    170    137     41    162     78    107     85     24     57    109     96    143     11     97     26     59     74    162     10     34     17      0     82    129     14    156     84     21     53    123     15
     21     30     33    146     15    127    117     53     67     88     55    123     80    157     25      9     88    137     29     17     61     71     17    103    140    154     80     90     53     98     82      0     47     67     73      8     79     29     41     73
     28     77     80    193     32    174    164     99    115     41      9    170     33    205     27     48    136    184     20     32     14    118     37    150    188    201     33    137    101    146    129     47      0    114     28     47    127     76      6    120
     86     42     42     80     82     60     51     15     18    155    122     56    147     92     92     70     29     71     94     82    128      3     82     38     73     88    148     23     22     31     14     67    114      0    141     70     22     38    108     12
     56    102    105    219     59    200    191    127    140     20     19    197     14    231     50     73    161    210     48     60     14    145     60    177    214    228     13    163    126    172    156     73     28    141      0     72    152    103     35    147
     25     30     32    147     16    128    118     56     68     88     54    125     80    158     22      1     89    138     32     22     61     74     12    104    141    155     81     91     54    100     84      8     47     70     72      0     79     31     42     74
    100     49     47     67     94     49     39     34     11    168    134     49    160     78    102     79      9     58    108     95    141     22     92     25     63     75    160     18     25     26     21     79    127     22    152     79      0     51    121     10
     49     11     14    117     44     97     88     25     39    117     84     94    109    128     53     31     60    107     57     44     90     42     44     74    111    125    110     60     25     69     53     29     76     38    103     31     51      0     70     44
     22     72     74    187     26    168    158     93    109     47     16    164     39    199     23     43    130    178     13     26     20    112     33    144    181    195     39    131     95    139    123     41      6    108     35     42    121     70      0    114
     93     45     43     72     88     53     43     24      9    162    128     51    154     84     97     74     18     63    101     88    135     11     87     29     67     81    154     17     21     26     15     73    120     12    147     74     10     44    114      0