# bench EOLE photo, generated by bep version 0.1, generation model "A"
bEpInstance_A_10_2
     10      2    100   1000     30     60     50    250    100    4.0
      1     70    810     32    710    910     74
      2     35    422     51    322    522     63
      3     59    643     60    543    743    109
      4     27     69     59    -31    169    126
      5     32    989     56    889   1089    105
      6     60    556     56    456    656     87
      7     40    890     56    790    990    113
      8     10     44     49    -56    144    211
      9     86    734     58    634    834     90
     10     15    625     38    525    725    199
      0     97     41    185     45     63     21    192     19     48
     97      0     55     88    141     34    117     94     79     50
     41     55      0    143     86     21     61    150     23     11
    185     88    143      0    230    122    205      7    166    139
     45    141     86    230      0    108     24    236     65     91
     63     34     21    122    108      0     83    128     44     20
     21    117     61    205     24     83      0    211     40     66
    192     94    150      7    236    128    211      0    173    145
     19     79     23    166     65     44     40    173      0     32
     48     50     11    139     91     20     66    145     32      0