# bench EOLE photo, generated by bep version 0.1, generation model "A"
bEpInstance_A_35_52
     35     52    100   1000     30     60     50    250    100    4.0
      1     62    457     36    357    557     74
      2      4    954     53    854   1054    112
      3     85    870     44    770    970    226
      4     83    647     30    547    747    121
      5     39    183     60     83    283    121
      6     69    756     44    656    856     93
      7     87    339     55    239    439     65
      8     21    701     43    601    801    216
      9     15    637     59    537    737     90
     10     59    694     45    594    794    138
     11     56    962     39    862   1062    128
     12     61    333     53    233    433    250
     13     52    738     40    638    838     91
     14     49    828     43    728    928    121
     15     16    231     43    131    331    126
     16     94    856     36    756    956     67
     17     49    155     38     55    255     66
     18     85    796     46    696    896    133
     19     76    844     54    744    944    123
     20     17    549     41    449    649    189
     21     28    721     57    621    821    206
     22     55    324     34    224    424    193
     23     56    568     32    468    668    147
     24     42    301     47    201    401    234
     25     46    864     60    764    964    111
     26     66    525     52    425    625    134
     27     37    524     54    424    624    159
     28      7    151     37     51    251    122
     29     88    137     34     37    237    134
     30     46    277     34    177    377     53
     31     85    231     45    131    331    104
     32     53     80     35    -20    180    248
     33     95    185     39     85    285    171
     34     71     14     30    -86    114     65
     35     54    808     49    708    908    173
      0    125    103     47     68     74     30     61     46     59    126     31     70     92     57    100     75     84     96     25     66     33     27     39    101     17     17     77     80     45     56     94     68    110     87
    125      0     29     79    192     52    155     63     79     66     13    155     55     33    180     33    200     44     32    101     58    158     97    163     24    108    107    200    205    169    181    218    193    235     38
    103     29      0     55    172     28    132     45     60     44     24    134     34     13    160      4    178     18      6     82     39    136     75    142      9     86     87    180    183    148    159    197    171    214     17
     47     79     55      0    116     27     77     20     17     13     79     78     24     46    105     52    123     37     49     29     23     81     20     87     55     30     32    125    127     92    104    141    115    158     40
     68    192    172    116      0    143     40    129    113    127    194     37    138    161     13    168      7    153    165     91    134     35     96     29    170     85     85     11     16     23     16     25     14     43    156
     74     52     28     27    143      0    104     18     32     15     51    105      6     18    131     25    150     10     22     53     13    108     47    113     27     57     58    152    154    119    131    169    142    185     13
     30    155    132     77     40    104      0     91     76     89    155      6    100    122     32    129     46    114    126     55     96      8     57     14    131     46     47     51     50     18     27     65     38     81    117
     61     63     45     20    129     18     91      0     16      9     65     92     12     32    117     42    136     28     38     38      5     94     34    100     41     45     44    137    141    106    118    155    130    172     27
     46     79     60     17    113     32     76     16      0     18     81     76     26     48    101     58    120     43     53     22     21     78     20     84     57     30     28    121    126     90    102    139    114    156     43
     59     66     44     13    127     15     89      9     18      0     67     90     11     33    116     41    134     26     37     37     10     92     31     98     42     42     42    136    139    104    115    153    127    170     28
    126     13     24     79    194     51    155     65     81     67      0    157     56     33    183     28    201     42     29    103     60    159     98    165     24    109    109    203    206    171    182    220    194    237     38
     31    155    134     78     37    105      6     92     76     90    157      0    101    123     27    131     44    115    127     55     97      2     58      9    132     48     48     47     49     14     26     63     37     79    118
     70     55     34     24    138      6    100     12     26     11     56    101      0     22    127     31    145     16     27     48      7    103     42    109     31     53     53    147    150    115    127    164    138    181     17
     92     33     13     46    161     18    122     32     48     33     33    123     22      0    149     13    168     12      7     70     27    126     65    131      9     75     76    169    173    137    149    187    161    203      5
     57    180    160    105     13    131     32    117    101    116    183     27    127    149      0    157     20    142    153     79    122     25     84     18    158     74     73     20     29     13     17     38     22     55    144
    100     33      4     52    168     25    129     42     58     41     28    131     31     13    157      0    175     15      5     79     37    133     72    139     12     83     84    177    179    145    156    194    167    210     15
     75    200    178    123      7    150     46    136    120    134    201     44    145    168     20    175      0    160    172     98    141     42    103     36    177     92     92     10     10     30     21     18     13     35    163
     84     44     18     37    153     10    114     28     43     26     42    115     16     12    142     15    160      0     12     64     23    118     57    124     19     67     69    162    164    130    141    179    152    195      8
     96     32      6     49    165     22    126     38     53     37     29    127     27      7    153      5    172     12      0     75     33    130     69    136      9     79     80    174    176    141    153    191    164    207     10
     25    101     82     29     91     53     55     38     22     37    103     55     48     70     79     79     98     64     75      0     43     57     10     62     79     13      8     99    104     68     81    117     93    134     65
     66     58     39     23    134     13     96      5     21     10     60     97      7     27    122     37    141     23     33     43      0     99     38    105     36     49     49    142    146    111    123    160    135    177     22
     33    158    136     81     35    108      8     94     78     92    159      2    103    126     25    133     42    118    130     57     99      0     61      6    135     50     50     44     47     11     24     61     36     77    121
     27     97     75     20     96     47     57     34     20     31     98     58     42     65     84     72    103     57     69     10     38     61      0     66     74     11     11    104    108     72     84    122     96    138     60
     39    163    142     87     29    113     14    100     84     98    165      9    109    131     18    139     36    124    136     62    105      6     66      0    140     56     55     38     42      6     20     55     31     72    126
    101     24      9     55    170     27    131     41     57     42     24    132     31      9    158     12    177     19      9     79     36    135     74    140      0     84     85    178    182    146    158    196    170    212     14
     17    108     86     30     85     57     46     45     30     42    109     48     53     75     74     83     92     67     79     13     49     50     11     56     84      0      7     94     97     62     73    111     85    127     70
     17    107     87     32     85     58     47     44     28     42    109     48     53     76     73     84     92     69     80      8     49     50     11     55     85      7      0     93     97     61     74    111     85    127     71
     77    200    180    125     11    152     51    137    121    136    203     47    147    169     20    177     10    162    174     99    142     44    104     38    178     94     93      0     20     32     27     21     23     37    164
     80    205    183    127     16    154     50    141    126    139    206     49    150    173     29    179     10    164    176    104    146     47    108     42    182     97     97     20      0     36     23     16     12     31    167
     45    169    148     92     23    119     18    106     90    104    171     14    115    137     13    145     30    130    141     68    111     11     72      6    146     62     61     32     36      0     15     49     26     66    132
     56    181    159    104     16    131     27    118    102    115    182     26    127    149     17    156     21    141    153     81    123     24     84     20    158     73     74     27     23     15      0     38     11     54    144
     94    218    197    141     25    169     65    155    139    153    220     63    164    187     38    194     18    179    191    117    160     61    122     55    196    111    111     21     16     49     38      0     28     17    182
     68    193    171    115     14    142     38    130    114    127    194     37    138    161     22    167     13    152    164     93    135     36     96     31    170     85     85     23     12     26     11     28      0     43    156
    110    235    214    158     43    185     81    172    156    170    237     79    181    203     55    210     35    195    207    134    177     77    138     72    212    127    127     37     31     66     54     17     43      0    198
     87     38     17     40    156     13    117     27     43     28     38    118     17      5    144     15    163      8     10     65     22    121     60    126     14     70     71    164    167    132    144    182    156    198      0