# bench EOLE photo, generated by bep version 0.1, generation model "A"
bEpInstance_A_20_17
     20     17    100   1000     30     60     50    250    100    4.0
      1     57      1     33    -99    101    234
      2     86    227     33    127    327    147
      3     66    905     49    805   1005     93
      4     28    338     55    238    438    203
      5     54    440     52    340    540    188
      6     16    603     41    503    703    197
      7     82     62     44    -38    162     95
      8     98    230     41    130    330    159
      9     23    480     44    380    580     67
     10     71    568     47    468    668    124
     11     47    198     48     98    298    201
     12     54    398     46    298    498     64
     13     84    243     53    143    343     51
     14     85    141     52     41    241    184
     15     20    219     57    119    319     85
     16     45    252     52    152    352    187
     17     73    176     53     76    276    138
     18     75    340     55    240    440     93
     19     54    394     60    294    494     64
     20     80    484     34    384    584    176
      0     56    226     84    109    150     16     58    120    141     49     99     60     35     55     62     43     84     98    120
     56      0    169     31     53     95     41      3     65     85     12     43      4     21     16     12     13     28     42     64
    226    169      0    142    116     76    210    168    106     84    176    126    165    191    171    163    182    141    127    105
     84     31    142      0     26     66     70     32     35     58     35     16     27     51     29     21     42     11     15     38
    109     53    116     26      0     41     94     53     12     32     60     10     49     75     55     47     66     25     11     12
    150     95     76     66     41      0    136     95     30     16    101     52     91    116     96     88    107     67     53     33
     16     41    210     70     94    136      0     42    105    126     35     84     45     19     42     48     28     69     83    105
     58      3    168     32     53     95     42      0     65     84     15     43      4     22     19     14     14     28     42     63
    120     65    106     35     12     30    105     65      0     25     70     21     61     86     65     57     77     37     22     14
    141     85     84     58     32     16    126     84     25      0     92     42     81    106     88     79     98     57     43     21
     49     12    176     35     60    101     35     15     70     92      0     50     14     17      8     13      8     36     49     71
     99     43    126     16     10     52     84     43     21     42     50      0     39     64     45     36     55     15      1     22
     60      4    165     27     49     91     45      4     61     81     14     39      0     25     17     10     16     24     38     60
     35     21    191     51     75    116     19     22     86    106     17     64     25      0     25     29      9     49     63     85
     55     16    171     29     55     96     42     19     65     88      8     45     17     25      0     10     17     33     44     67
     62     12    163     21     47     88     48     14     57     79     13     36     10     29     10      0     20     23     35     58
     43     13    182     42     66    107     28     14     77     98      8     55     16      9     17     20      0     41     54     77
     84     28    141     11     25     67     69     28     37     57     36     15     24     49     33     23     41      0     14     36
     98     42    127     15     11     53     83     42     22     43     49      1     38     63     44     35     54     14      0     23
    120     64    105     38     12     33    105     63     14     21     71     22     60     85     67     58     77     36     23      0