# bench EOLE photo, generated by bep version 0.1, generation model "A"
bEpInstance_A_35_90
     35     90    100   1000     30     60     50    250    100    4.0
      1     74    659     36    559    759    208
      2     54    850     59    750    950    155
      3     47     90     55    -10    190     57
      4      8    124     51     24    224    215
      5     30    738     56    638    838    154
      6     96    829     51    729    929    117
      7     60    573     39    473    673     54
      8     25    154     41     54    254    248
      9     82    574     54    474    674    121
     10     42    744     57    644    844    228
     11     84    704     58    604    804    234
     12     83    633     53    533    733     76
     13     37    587     50    487    687    116
     14     42    348     50    248    448     53
     15     93    968     31    868   1068     84
     16     12    400     34    300    500    238
     17     98    937     38    837   1037    130
     18     68    172     38     72    272    153
     19     88    216     43    116    316    191
     20     85    176     55     76    276     94
     21     77    486     46    386    586     85
     22     84    213     36    113    313    201
     23     18    243     58    143    343    111
     24     64     88     37    -12    188    174
     25      2    530     30    430    630    191
     26     70    305     36    205    405    166
     27     52    655     38    555    755    124
     28     83    117     48     17    217    169
     29     60    137     53     37    237    137
     30     35    972     36    872   1072    157
     31     21    122     55     22    222    222
     32     21     76     44    -24    176     97
     33     61    492     59    392    592    111
     34     80    164     57     64    264    114
     35     82    166     51     66    266    180
      0     48    142    134     22     42     21    126     21     22     11      6     20     78     77     66     69    121    110    120     43    111    104    142     36     88      5    135    130     78    134    146     41    123    123
     48      0    190    181     28     11     69    174     69     26     37     54     65    125     31    112     24    169    158    168     91    159    152    190     81    136     48    183    178     30    182    193     89    171    171
    142    190      0     12    162    185    120     16    121    163    153    136    124     64    219     77    212     21     33     23     99     32     38      4    110     54    141     11     12    220     10      7    100     20     20
    134    181     12      0    153    177    113      8    114    155    146    128    115     56    212     69    204     19     30     23     92     29     29     16    101     47    133     18     13    212      3     12     92     20     21
     22     28    162    153      0     28     41    146     43      3     15     29     37     97     59     84     52    141    131    141     64    131    123    162     52    108     21    155    150     58    154    165     61    144    143
     42     11    185    177     28      0     64    169     63     25     31     49     62    121     34    109     27    164    153    163     85    154    147    185     78    131     44    178    173     38    177    189     84    166    165
     21     69    120    113     41     64      0    105      5     42     33     16      6     56     99     44     91    100     89     99     22     90     83    121     18     67     20    114    109     99    113    124     20    102    101
    126    174     16      8    146    169    105      0    105    147    138    120    108     48    204     61    196     11     22     15     84     20     22     19     94     39    125     17      9    204      8     19     84     13     14
     21     69    121    114     43     63      5    105      0     43     32     14     11     57     98     46     90    100     89     99     22     90     84    121     22     67     21    114    109    100    114    125     21    102    102
     22     26    163    155      3     25     42    147     43      0     14     29     39     99     57     86     50    143    132    142     65    133    125    164     54    109     22    157    151     57    155    167     63    145    144
     11     37    153    146     15     31     33    138     32     14      0     17     31     89     66     78     58    133    122    132     54    122    116    154     48     99     14    146    141     68    146    157     53    135    134
      6     54    136    128     29     49     16    120     14     29     17      0     16     71     83     60     76    115    104    114     36    105     98    136     32     82      9    129    124     85    128    140     35    117    116
     20     65    124    115     37     62      6    108     11     39     31     16      0     59     96     47     88    104     93    103     27     94     86    124     16     70     17    118    112     96    116    127     24    106    105
     78    125     64     56     97    121     56     48     57     99     89     71     59      0    155     15    147     44     34     44     35     35     26     65     46     12     76     58     52    156     56     68     36     46     46
     77     31    219    212     59     34     99    204     98     57     66     83     96    155      0    143      7    199    188    198    120    188    182    220    111    165     78    212    207     14    212    223    119    201    200
     66    112     77     69     84    109     44     61     46     86     78     60     47     15    143      0    135     58     49     58     26     50     39     79     32     27     64     72     66    143     69     81     26     61     61
     69     24    212    204     52     27     91    196     90     50     58     76     88    147      7    135      0    191    180    190    112    181    174    212    104    158     71    205    200     18    204    216    111    193    192
    121    169     21     19    141    164    100     11    100    143    133    115    104     44    199     58    191      0     12      4     78     11     21     21     91     33    120     14      8    200     17     26     80      3      3
    110    158     33     30    131    153     89     22     89    132    122    104     93     34    188     49    180     12      0     10     67      1     18     32     81     22    110     24     20    189     28     38     69     13     12
    120    168     23     23    141    163     99     15     99    142    132    114    103     44    198     58    190      4     10      0     77      9     23     22     90     32    120     14     11    199     20     29     79      3      2
     43     91     99     92     64     85     22     84     22     65     54     36     27     35    120     26    112     78     67     77      0     68     62     99     21     45     42     92     87    121     92    103      4     80     80
    111    159     32     29    131    154     90     20     90    133    122    105     94     35    188     50    181     11      1      9     68      0     18     31     81     23    110     24     19    190     27     37     69     12     11
    104    152     38     29    123    147     83     22     84    125    116     98     86     26    182     39    174     21     18     23     62     18      0     40     71     20    103     35     28    182     30     41     63     25     25
    142    190      4     16    162    185    121     19    121    164    154    136    124     65    220     79    212     21     32     22     99     31     40      0    111     54    141      8     12    221     13     11    101     19     20
     36     81    110    101     52     78     18     94     22     54     48     32     16     46    111     32    104     91     81     90     21     81     71    111      0     58     33    105     99    110    102    113     17     93     93
     88    136     54     47    108    131     67     39     67    109     99     82     70     12    165     27    158     33     22     32     45     23     20     54     58      0     87     47     42    166     47     58     46     35     34
      5     48    141    133     21     44     20    125     21     22     14      9     17     76     78     64     71    120    110    120     42    110    103    141     33     87      0    134    129     79    133    144     40    122    122
    135    183     11     18    155    178    114     17    114    157    146    129    118     58    212     72    205     14     24     14     92     24     35      8    105     47    134      0      7    214     15     18     93     11     12
    130    178     12     13    150    173    109      9    109    151    141    124    112     52    207     66    200      8     20     11     87     19     28     12     99     42    129      7      0    208     10     18     88      8      9
     78     30    220    212     58     38     99    204    100     57     68     85     96    156     14    143     18    200    189    199    121    190    182    221    110    166     79    214    208      0    212    224    120    202    201
    134    182     10      3    154    177    113      8    114    155    146    128    116     56    212     69    204     17     28     20     92     27     30     13    102     47    133     15     10    212      0     11     93     18     18
    146    193      7     12    165    189    124     19    125    167    157    140    127     68    223     81    216     26     38     29    103     37     41     11    113     58    144     18     18    224     11      0    104     26     27
     41     89    100     92     61     84     20     84     21     63     53     35     24     36    119     26    111     80     69     79      4     69     63    101     17     46     40     93     88    120     93    104      0     82     81
    123    171     20     20    144    166    102     13    102    145    135    117    106     46    201     61    193      3     13      3     80     12     25     19     93     35    122     11      8    202     18     26     82      0      0
    123    171     20     21    143    165    101     14    102    144    134    116    105     46    200     61    192      3     12      2     80     11     25     20     93     34    122     12      9    201     18     27     81      0      0