# bench EOLE photo, generated by bep version 0.1, generation model "A"
bEpInstance_A_20_55
     20     55    100   1000     30     60     50    250    100    4.0
      1     19    200     49    100    300    167
      2     85    121     40     21    221     90
      3     78    127     45     27    227    124
      4      3    310     45    210    410    198
      5     95    488     32    388    588    220
      6     93    679     32    579    779    219
      7     57    792     44    692    892     85
      8     51    667     54    567    767    190
      9     87    417     38    317    517    194
     10     54    616     58    516    716    112
     11     75    406     51    306    506    206
     12     72    183     46     83    283    182
     13     67    599     45    499    699    169
     14     28    606     43    506    706    219
     15     40    900     30    800   1000    231
     16     57    812     48    712    912    137
     17     23    886     34    786    986    204
     18     50     67     32    -33    167     99
     19     47    764     30    664    864     88
     20     95    544     56    444    644    174
      0     25     23     27     74    121    148    117     56    104     53     13    100    101    175    153    171     34    141     88
     25      0      2     51     91    139    167    136     74    123     71     15    119    122    195    172    191     16    161    105
     23      2      0     49     90    138    166    135     72    122     69     14    118    120    193    171    190     16    159    104
     27     51     49      0     50     94    121     90     34     77     30     36     74     74    147    126    144     61    114     62
     74     91     90     50      0     47     76     46     17     33     21     76     28     33    103     81    101    105     70     14
    121    139    138     94     47      0     29     10     65     18     68    124     21     24     56     34     54    153     24     33
    148    167    166    121     76     29      0     31     94     44     96    152     48     47     27      5     24    181      7     62
    117    136    135     90     46     10     31      0     63     12     65    121     17     16     58     36     55    150     24     32
     56     74     72     34     17     65     94     63      0     50      4     58     45     49    121     99    118     87     87     31
    104    123    122     77     33     18     44     12     50      0     52    108      5      6     71     49     67    137     37     20
     53     71     69     30     21     68     96     65      4     52      0     55     48     51    123    101    120     84     89     34
     13     15     14     36     76    124    152    121     58    108     55      0    104    106    179    157    176     29    145     90
    100    119    118     74     28     21     48     17     45      5     48    104      0      9     75     53     72    133     41     15
    101    122    120     74     33     24     47     16     49      6     51    106      9      0     73     52     70    134     39     22
    175    195    193    147    103     56     27     58    121     71    123    179     75     73      0     22      5    208     34     90
    153    172    171    126     81     34      5     36     99     49    101    157     53     52     22      0     20    186     12     67
    171    191    190    144    101     54     24     55    118     67    120    176     72     70      5     20      0    204     31     87
     34     16     16     61    105    153    181    150     87    137     84     29    133    134    208    186    204      0    174    119
    141    161    159    114     70     24      7     24     87     37     89    145     41     39     34     12     31    174      0     56
     88    105    104     62     14     33     62     32     31     20     34     90     15     22     90     67     87    119     56      0