# bench EOLE photo, generated by bep version 0.1, generation model "A"
bEpInstance_A_35_49
     35     49    100   1000     30     60     50    250    100    4.0
      1      4    220     39    120    320     82
      2     75    295     50    195    395    236
      3     44    618     58    518    718    230
      4     63    996     46    896   1096    246
      5     85    899     42    799    999    125
      6     49    349     56    249    449    173
      7     18    407     35    307    507    150
      8     94    775     32    675    875    247
      9    100    396     34    296    496    198
     10     69    809     50    709    909     76
     11     43    594     30    494    694     60
     12     59    575     30    475    675    138
     13     47    448     55    348    548    242
     14     80    684     47    584    784    246
     15      9    764     44    664    864     56
     16     54    565     30    465    665    157
     17     97    158     38     58    258    181
     18     97    936     54    836   1036    128
     19     53    813     43    713    913     73
     20     39    477     47    377    577    222
     21     93    370     55    270    470    195
     22      5    391     51    291    491     78
     23     15    179     35     79    279    189
     24     75    187     37     87    287    191
     25     34    499     41    399    599    112
     26     43    142     51     42    242    243
     27     96    151     32     51    251    118
     28     63    640     36    540    740    161
     29      0     21     38    -79    121     62
     30     41    977     36    877   1077    163
     31     15    381     38    281    481    230
     32     57    488     48    388    588    233
     33     99    964     37    864   1064    134
     34     10    933     41    833   1033     62
     35      8    468     42    368    568    192
      0     25    100    194    170     34     46    140     50    148     94     89     58    117    136     87     27    180    148     64     43     42     10     19     70     21     28    106     49    189     40     68    187    178     62
     25      0     81    175    151     14     31    120     26    128     75     70     38     97    118     67     34    160    129     46     19     29     32     27     52     39     36     86     71    170     26     48    167    160     46
    100     81      0     94     70     67     53     41     57     48      6     11     42     18     37     13    115     80     48     35     63     57    109    108     29    119    117      7    149     89     59     32     87     79     38
    194    175     94      0     24    161    147     55    150     46    100    105    137     78     59    107    209     17     45    129    156    151    204    202    124    213    211     89    244      7    154    127     12     20    132
    170    151     70     24      0    137    124     31    125     22     76     81    113     53     38     83    185      9     22    106    132    128    180    178    100    189    187     64    220     22    130    102     16     20    109
     34     14     67    161    137      0     16    107     17    115     61     56     24     84    104     54     49    147    116     32     12     15     43     41     37     51     50     72     82    157     11     34    154    146     31
     46     31     53    147    124     16      0     93     20    101     47     43     12     70     89     40     65    133    101     18     20      5     57     56     23     66     66     59     96    142      6     22    140    131     15
    140    120     41     55     31    107     93      0     94     10     47     50     82     23     21     53    154     40     13     75    101     98    150    147     70    158    156     34    189     52    100     72     47     44     79
     50     26     57    150    125     17     20     94      0    103     51     45     18     72     94     43     59    135    104     25      6     23     58     52     30     65     61     61     97    145     21     25    142    136     29
    148    128     48     46     22    115    101     10    103      0     54     58     90     31     18     61    162     32      4     83    109    105    158    155     77    166    164     42    197     42    107     80     39     34     86
     94     75      6    100     76     61     47     47     51     54      0      6     36     24     43      7    109     86     54     29     57     51    103    102     23    113    111     12    143     95     53     26     93     85     32
     89     70     11    105     81     56     43     50     45     58      6      0     31     27     48      2    104     90     59     25     51     47     99     97     20    108    106     16    139    100     49     21     97     90     29
     58     38     42    137    113     24     12     82     18     90     36     31      0     59     79     29     73    122     91      7     22     17     67     65     13     76     75     48    107    132     18     10    129    121     10
    117     97     18     78     53     84     70     23     72     31     24     27     59      0     26     30    131     63     32     52     78     75    127    124     47    135    133     11    166     73     77     49     70     64     56
    136    118     37     59     38    104     89     21     94     18     43     48     79     26      0     51    153     48     16     72    100     93    146    145     66    155    154     33    185     53     95     70     54     42     74
     87     67     13    107     83     54     40     53     43     61      7      2     29     30     51      0    102     93     62     22     49     45     96     94     17    105    104     18    136    103     47     19    100     92     26
     27     34    115    209    185     49     65    154     59    162    109    104     73    131    153    102      0    194    164     81     53     62     21      9     86     14      1    120     41    205     59     83    201    194     80
    180    160     80     17      9    147    133     40    135     32     86     90    122     63     48     93    194      0     32    115    141    138    190    187    110    198    196     74    230     17    140    112      7     21    119
    148    129     48     45     22    116    101     13    104      4     54     59     91     32     16     62    164     32      0     84    111    106    158    156     78    167    165     43    198     41    108     81     39     31     86
     64     46     35    129    106     32     18     75     25     83     29     25      7     52     72     22     81    115     84      0     29     23     74     73      5     83     82     41    114    125     24      5    122    114      8
     43     19     63    156    132     12     20    101      6    109     57     51     22     78    100     49     53    141    111     29      0     22     51     45     35     58     54     67     90    152     19     30    148    142     32
     42     29     57    151    128     15      5     98     23    105     51     47     17     75     93     45     62    138    106     23     22      0     53     53     27     62     64     63     92    146      3     27    145    135     19
     10     32    109    204    180     43     57    150     58    158    103     99     67    127    146     96     21    190    158     74     51     53      0     15     80     11     21    115     39    199     50     77    197    188     72
     19     27    108    202    178     41     56    147     52    155    102     97     65    124    145     94      9    187    156     73     45     53     15      0     78     13     10    113     45    197     50     75    194    187     72
     70     52     29    124    100     37     23     70     30     77     23     20     13     47     66     17     86    110     78      5     35     27     80     78      0     89     88     35    119    119     29      6    117    108     10
     21     39    119    213    189     51     66    158     65    166    113    108     76    135    155    105     14    198    167     83     58     62     11     13     89      0     13    124     32    208     60     86    205    197     81
     28     36    117    211    187     50     66    156     61    164    111    106     75    133    154    104      1    196    165     82     54     64     21     10     88     13      0    122     40    206     60     84    203    196     82
    106     86      7     89     64     72     59     34     61     42     12     16     48     11     33     18    120     74     43     41     67     63    115    113     35    124    122      0    155     84     65     38     81     74     45
     49     71    149    244    220     82     96    189     97    197    143    139    107    166    185    136     41    230    198    114     90     92     39     45    119     32     40    155      0    239     90    117    237    228    111
    189    170     89      7     22    157    142     52    145     42     95    100    132     73     53    103    205     17     41    125    152    146    199    197    119    208    206     84    239      0    149    122     14     13    127
     40     26     59    154    130     11      6    100     21    107     53     49     18     77     95     47     59    140    108     24     19      3     50     50     29     60     60     65     90    149      0     28    147    138     21
     68     48     32    127    102     34     22     72     25     80     26     21     10     49     70     19     83    112     81      5     30     27     77     75      6     86     84     38    117    122     28      0    119    111     13
    187    167     87     12     16    154    140     47    142     39     93     97    129     70     54    100    201      7     39    122    148    145    197    194    117    205    203     81    237     14    147    119      0     23    126
    178    160     79     20     20    146    131     44    136     34     85     90    121     64     42     92    194     21     31    114    142    135    188    187    108    197    196     74    228     13    138    111     23      0    116
     62     46     38    132    109     31     15     79     29     86     32     29     10     56     74     26     80    119     86      8     32     19     72     72     10     81     82     45    111    127     21     13    126    116      0