# bench EOLE photo, generated by bep version 0.1, generation model "A"
bEpInstance_A_45_54
     45     54    100   1000     30     60     50    250    100    4.0
      1     33    782     55    682    882    202
      2     41    393     59    293    493    230
      3     96    533     60    433    633    190
      4     63    247     60    147    347    203
      5     75    710     56    610    810    185
      6     33    855     57    755    955    241
      7     31    789     36    689    889    141
      8     89    324     34    224    424     93
      9     10    960     60    860   1060    153
     10     35    935     42    835   1035    112
     11     47    382     30    282    482     68
     12     63      6     56    -94    106    126
     13     72    729     31    629    829     60
     14     58    923     30    823   1023    230
     15     71    229     40    129    329    169
     16     55    492     55    392    592    182
     17     45    782     35    682    882    211
     18     72    585     33    485    685     87
     19     97    129     38     29    229    169
     20     13    135     60     35    235    221
     21     87     25     58    -75    125    140
     22     95    909     40    809   1009    182
     23     13    694     37    594    794    188
     24     18     64     40    -36    164    178
     25     85    524     43    424    624    163
     26     10    559     53    459    659     65
     27     69     24     50    -76    124    215
     28     16    647     50    547    747     54
     29     67    580     44    480    680    174
     30     49    815     38    715    915    175
     31     51    533     39    433    633    189
     32     60    667     40    567    767    138
     33     19    774     30    674    874    110
     34     33    752     41    652    852     54
     35     78     47     56    -53    147    238
     36     70    522     59    422    622    123
     37     10    430     60    330    530    168
     38     24    263     36    163    363    201
     39     80    534     43    434    634    128
     40     20    779     55    679    879    128
     41     55    840     51    740    940    227
     42     59     66     58    -34    166    123
     43     11    752     39    652    852    212
     44     27    263     35    163    363    125
     45     70    159     59     59    259    238
      0     97     64    133     20     18      1    115     44     38    100    194     16     35    138     72      3     50    164    161    189     35     22    179     65     56    189     34     51      9     62     29      4      7    184     65     88    129     63      3     15    179      9    129    156
     97      0     37     36     79    115     99     21    141    135      3     96     84    132     41     24     97     48     67     64     92    129     75     82     34     42     92     63     47    105     35     68     95     89     86     33     12     32     36     96    111     81     90     32     58
     64     37      0     71     44     82     66     52    108    101     39    132     49     97     76     14     63     14    101    101    127     94     45    118      3     22    127     34     13     71     11     34     63     56    121      7     33     69      4     64     77    117     58     69     93
    133     36     71      0    115    152    135     20    178    172     33     60    120    169      4     61    133     84     30     30     55    165    112     47     69     79     55    100     83    142     71    105    132    126     50     68     47     10     71    133    148     45    126      9     22
     20     79     44    115      0     37     22     96     64     57     82    176      4     53    120     54     19     31    145    144    171     50     16    162     46     41    171     21     32     27     44     11     21     14    165     47     71    112     44     22     32    161     19    112    137
     18    115     82    152     37      0     16    133     26     20    118    212     32     18    156     90     18     68    182    180    207     20     40    197     83     74    207     52     69     10     80     47     20     25    202     83    106    148     81     19      6    197     26    148    174
      1     99     66    135     22     16      0    117     43     36    101    195     18     34    140     74      3     52    165    163    191     34     24    181     67     57    191     35     53      7     64     31      4      9    185     67     89    131     64      3     14    180     10    131    157
    115     21     52     20     96    133    117      0    160    153     17     79    101    149     24     42    115     65     48     50     74    146     94     67     50     61     75     82     64    123     53     86    113    107     69     49     33     22     52    115    129     64    108     21     41
     44    141    108    178     64     26     43    160      0      8    144    238     59     15    183    117     45     95    208    206    234     24     66    224    110    100    234     78     96     37    107     74     46     52    228    110    132    174    107     45     32    223     52    174    200
     38    135    101    172     57     20     36    153      8      0    138    232     52      6    176    110     38     87    202    200    227     16     60    217    103     94    227     72     89     30    100     67     40     45    222    103    126    168    100     39     24    217     46    168    194
    100      3     39     33     82    118    101     17    144    138      0     94     86    135     38     27    100     51     64     62     89    132     78     79     36     45     89     66     49    108     37     71     98     92     84     35     15     30     38     99    114     79     92     30     56
    194     96    132     60    176    212    195     79    238    232     94      0    180    229     55    121    194    144     31     34      7    225    172     18    129    138      4    160    143    202    131    165    192    186     10    129    106     64    132    193    208     15    186     64     38
     16     84     49    120      4     32     18    101     59     52     86    180      0     48    125     59     14     36    150    149    176     45     17    166     51     45    176     24     37     22     49     15     17     11    170     51     76    117     48     18     28    165     16    117    142
     35    132     97    169     53     18     34    149     15      6    135    229     48      0    173    107     35     84    198    197    224      9     58    214     99     91    224     69     85     27     97     64     38     43    219    100    123    165     97     37     20    214     44    165    191
    138     41     76      4    120    156    140     24    183    176     38     55    125    173      0     65    138     89     25     27     51    170    117     43     73     83     51    105     87    146     76    109    136    131     45     73     52     14     76    138    152     40    131     13     17
     72     24     14     61     54     90     74     42    117    110     27    121     59    107     65      0     72     23     91     89    117    104     51    107     10     20    117     39     22     80     10     43     71     65    111      8     19     57     12     72     87    106     65     57     83
      3     97     63    133     19     18      3    115     45     38    100    194     14     35    138     72      0     49    163    161    189     34     23    179     65     56    189     34     50      8     62     28      6      8    183     65     88    129     62      6     14    179     11    129    155
     50     48     14     84     31     68     52     65     95     87     51    144     36     84     89     23     49      0    114    113    140     81     30    130     15     16    140     20      1     57     14     20     49     42    134     15     41     81     12     50     63    129     44     81    106
    164     67    101     30    145    182    165     48    208    202     64     31    150    198     25     91    163    114      0     21     26    195    142     25     98    109     27    131    112    171    101    134    162    156     21     98     78     38    101    163    178     18    157     37     10
    161     64    101     30    144    180    163     50    206    200     62     34    149    197     27     89    161    113     21      0     33    194    139     17     98    106     31    128    112    170     99    133    159    154     27     97     73     32    101    161    176     20    154     32     15
    189     92    127     55    171    207    191     74    234    227     89      7    176    224     51    117    189    140     26     33      0    221    168     19    124    134      4    156    138    197    127    160    188    182      5    124    103     61    127    189    203     12    182     61     33
     35    129     94    165     50     20     34    146     24     16    132    225     45      9    170    104     34     81    195    194    221      0     57    212     96     90    221     68     82     26     94     61     38     42    215     96    121    162     93     37     19    210     44    162    187
     22     75     45    112     16     40     24     94     66     60     78    172     17     58    117     51     23     30    142    139    168     57      0    157     46     33    168     11     31     31     41     13     20     15    162     45     66    107     43     21     37    157     14    107    134
    179     82    118     47    162    197    181     67    224    217     79     18    166    214     43    107    179    130     25     17     19    212    157      0    116    123     16    145    129    187    117    151    177    172     15    115     91     49    118    178    194     10    172     49     27
     65     34      3     69     46     83     67     50    110    103     36    129     51     99     73     10     65     15     98     98    124     96     46    116      0     20    125     35     14     73      8     36     64     58    119      3     30     67      2     65     79    114     59     66     91
     56     42     22     79     41     74     57     61    100     94     45    138     45     91     83     20     56     16    109    106    134     90     33    123     20      0    134     22     15     64     12     29     53     48    129     17     32     74     18     55     71    123     48     74    101
    189     92    127     55    171    207    191     75    234    227     89      4    176    224     51    117    189    140     27     31      4    221    168     16    125    134      0    156    139    197    127    160    187    182      6    124    102     60    127    189    204     10    182     60     33
     34     63     34    100     21     52     35     82     78     72     66    160     24     69    105     39     34     20    131    128    156     68     11    145     35     22    156      0     21     42     29     12     31     26    150     34     54     96     32     33     49    145     26     96    122
     51     47     13     83     32     69     53     64     96     89     49    143     37     85     87     22     50      1    112    112    138     82     31    129     14     15    139     21      0     58     12     21     49     43    133     14     40     79     11     51     65    128     45     79    105
      9    105     71    142     27     10      7    123     37     30    108    202     22     27    146     80      8     57    171    170    197     26     31    187     73     64    197     42     58      0     70     37     12     16    192     73     96    138     70     11      6    187     18    138    164
     62     35     11     71     44     80     64     53    107    100     37    131     49     97     76     10     62     14    101     99    127     94     41    117      8     12    127     29     12     70      0     33     60     54    121      5     27     67      7     61     76    116     55     67     93
     29     68     34    105     11     47     31     86     74     67     71    165     15     64    109     43     28     20    134    133    160     61     13    151     36     29    160     12     21     37     33      0     28     22    155     36     60    101     33     29     43    150     24    101    127
      4     95     63    132     21     20      4    113     46     40     98    192     17     38    136     71      6     49    162    159    188     38     20    177     64     53    187     31     49     12     60     28      0      6    182     64     86    127     61      1     18    177      5    127    154
      7     89     56    126     14     25      9    107     52     45     92    186     11     43    131     65      8     42    156    154    182     42     15    172     58     48    182     26     43     16     54     22      6      0    176     58     80    122     55      7     22    171      5    122    148
    184     86    121     50    165    202    185     69    228    222     84     10    170    219     45    111    183    134     21     27      5    215    162     15    119    129      6    150    133    192    121    155    182    176      0    118     97     55    121    183    198      6    177     55     28
     65     33      7     68     47     83     67     49    110    103     35    129     51    100     73      8     65     15     98     97    124     96     45    115      3     17    124     34     14     73      5     36     64     58    118      0     27     65      3     65     79    114     59     65     90
     88     12     33     47     71    106     89     33    132    126     15    106     76    123     52     19     88     41     78     73    103    121     66     91     30     32    102     54     40     96     27     60     86     80     97     27      0     41     31     87    103     91     80     41     69
    129     32     69     10    112    148    131     22    174    168     30     64    117    165     14     57    129     81     38     32     61    162    107     49     67     74     60     96     79    138     67    101    127    122     55     65     41      0     69    129    144     50    122      0     28
     63     36      4     71     44     81     64     52    107    100     38    132     48     97     76     12     62     12    101    101    127     93     43    118      2     18    127     32     11     70      7     33     61     55    121      3     31     69      0     63     76    117     57     69     93
      3     96     64    133     22     19      3    115     45     39     99    193     18     37    138     72      6     50    163    161    189     37     21    178     65     55    189     33     51     11     61     29      1      7    183     65     87    129     63      0     17    178      7    129    155
     15    111     77    148     32      6     14    129     32     24    114    208     28     20    152     87     14     63    178    176    203     19     37    194     79     71    204     49     65      6     76     43     18     22    198     79    103    144     76     17      0    193     24    144    170
    179     81    117     45    161    197    180     64    223    217     79     15    165    214     40    106    179    129     18     20     12    210    157     10    114    123     10    145    128    187    116    150    177    171      6    114     91     50    117    178    193      0    171     49     23
      9     90     58    126     19     26     10    108     52     46     92    186     16     44    131     65     11     44    157    154    182     44     14    172     59     48    182     26     45     18     55     24      5      5    177     59     80    122     57      7     24    171      0    122    148
    129     32     69      9    112    148    131     21    174    168     30     64    117    165     13     57    129     81     37     32     61    162    107     49     66     74     60     96     79    138     67    101    127    122     55     65     41      0     69    129    144     49    122      0     28
    156     58     93     22    137    174    157     41    200    194     56     38    142    191     17     83    155    106     10     15     33    187    134     27     91    101     33    122    105    164     93    127    154    148     28     90     69     28     93    155    170     23    148     28      0