# bench EOLE photo, generated by bep version 0.1, generation model "A"
bEpInstance_A_10_77
     10     77    100   1000     30     60     50    250    100    4.0
      1      7    288     54    188    388    175
      2     90    480     38    380    580    188
      3    100    488     51    388    588    237
      4     87    948     55    848   1048    120
      5     44    304     40    204    404    232
      6     52    872     47    772    972     52
      7     62    833     47    733    933    247
      8      3    574     56    474    674     72
      9     87    632     52    532    732    202
     10     11     11     43    -89    111     71
      0     52     55    166     10    146    136     71     88     69
     52      0      3    117     45     98     88     32     38    118
     55      3      0    115     48     96     86     32     36    121
    166    117    115      0    161     20     29     95     79    235
     10     45     48    161      0    142    132     68     82     73
    146     98     96     20    142      0     10     75     60    215
    136     88     86     29    132     10      0     66     50    205
     71     32     32     95     68     75     66      0     25    140
     88     38     36     79     82     60     50     25      0    156
     69    118    121    235     73    215    205    140    156      0