# bench EOLE photo, generated by bep version 0.1, generation model "A"
bEpInstance_A_10_100
     10    100    100   1000     30     60     50    250    100    4.0
      1     31    285     37    185    385    147
      2     37     53     47    -47    153    244
      3     52    429     42    329    529     80
      4     59    632     49    532    732    132
      5     10    872     38    772    972    174
      6     67    358     36    258    458    157
      7     38    845     57    745    945    142
      8     65    773     45    673    873    244
      9      5    737     43    637    837    137
     10     79     20     42    -80    120    111
      0     58     36     87    146     20    140    122    113     67
     58      0     94    144    204     76    198    180    171     13
     36     94      0     50    111     18    104     86     77    102
     87    144     50      0     61     68     53     35     29    153
    146    204    111     61      0    129      9     28     33    213
     20     76     18     68    129      0    121    103     96     84
    140    198    104     53      9    121      0     19     28    206
    122    180     86     35     28    103     19      0     17    188
    113    171     77     29     33     96     28     17      0    180
     67     13    102    153    213     84    206    188    180      0