# bench EOLE photo, generated by bep version 0.1, generation model "A"
bEpInstance_A_15_94
     15     94    100   1000     30     60     50    250    100    4.0
      1     17    313     58    213    413    164
      2     28    237     58    137    337     92
      3     69    933     56    833   1033    188
      4     19    336     35    236    436    184
      5     54    803     33    703    903     84
      6     76     53     30    -47    153    217
      7     53    999     50    899   1099    214
      8     13    925     40    825   1025    110
      9     24    266     57    166    366    154
     10     50    788     52    688    888     89
     11     72    592     57    492    692    233
     12     93     63     48    -37    163    143
     13     87    704     49    604    804    175
     14     76    651     44    551    751    108
     15     65    108     33      8    208    206
      0     19    155      5    122     66    171    153     11    119     71     65     99     85     52
     19      0    174     24    141     47    190    172      7    137     89     46    117    104     33
    155    174      0    149     32    220     16     14    167     36     85    217     57     70    206
      5     24    149      0    117     72    165    147     17    113     65     70     93     80     58
    122    141     32    117      0    187     49     32    134      3     52    185     26     38    173
     66     47    220     72    187      0    236    218     54    183    134      4    162    149     14
    171    190     16    165     49    236      0     21    183     52    101    234     74     87    222
    153    172     14    147     32    218     21      0    164     35     84    216     58     70    204
     11      7    167     17    134     54    183    164      0    130     82     53    110     97     40
    119    137     36    113      3    183     52     35    130      0     49    181     22     34    170
     71     89     85     65     52    134    101     84     82     49      0    132     28     14    121
     65     46    217     70    185      4    234    216     53    181    132      0    160    147     13
     99    117     57     93     26    162     74     58    110     22     28    160      0     13    149
     85    104     70     80     38    149     87     70     97     34     14    147     13      0    135
     52     33    206     58    173     14    222    204     40    170    121     13    149    135      0