# bench EOLE photo, generated by bep version 0.1, generation model "A"
bEpInstance_A_40_27
     40     27    100   1000     30     60     50    250    100    4.0
      1     66    135     34     35    235     74
      2     70    439     52    339    539    138
      3     72    258     52    158    358    118
      4     30    363     37    263    463    124
      5     87    590     35    490    690    114
      6     40    660     58    560    760    242
      7     64    372     48    272    472    190
      8     92    382     31    282    482    165
      9     52    192     51     92    292     93
     10     63    424     50    324    524    120
     11     68    382     51    282    482    247
     12     75    927     40    827   1027    171
     13     52    525     58    425    625    234
     14     18    845     57    745    945    214
     15     21    458     46    358    558     76
     16     84    560     52    460    660    121
     17     75    410     47    310    510    127
     18     84    229     52    129    329    153
     19     61    427     45    327    527    121
     20     35    853     59    753    953    224
     21     38    889     54    789    989    162
     22     74    657     41    557    757    241
     23     11    900     32    800   1000    241
     24     46    797     39    697    897     92
     25     20    886     48    786    986     58
     26     11    331     47    231    431    195
     27     76     54     32    -46    154     72
     28     91     42     60    -58    142    107
     29     94    768     56    668    868    183
     30     42    227     49    127    327    158
     31     12    703     45    603    803    167
     32     50    807     54    707    907    191
     33     69    393     53    293    493    212
     34     73    300     46    200    400    147
     35     35    612     48    512    712    102
     36     66    579     46    479    679    167
     37     35    394     37    294    494    205
     38     62    868     39    768    968    200
     39     57    806     40    706    906     64
     40     61    132     54     32    232    111
      0     76     30     57    113    131     59     62     14     72     61    198     97    177     81    106     68     23     73    179    188    130    191    165    188     50     20     24    158     23    142    168     64     41    119    111     65    183    167      1
     76      0     45     21     37     55     16     15     61      4     14    122     21    102     13     30      7     52      3    103    112     54    116     89    112     30     96     99     82     53     67     92     11     34     44     35     14    107     91     76
     30     45      0     28     83    100     28     31     17     41     31    167     66    147     51     75     38      7     42    149    157     99    161    134    157     23     51     54    127     10    112    137     33     10     88     80     35    152    137     31
     57     21     28      0     58     74      8     16     43     17     10    141     40    120     23     51     16     36     17    122    131     74    134    108    130      9     78     81    102     34     85    111     12     19     62     54      7    126    110     58
    113     37     83     58      0     21     54     52     99     41     52     84     18     66     36      7     45     90     41     67     75     17     79     52     75     67    134    137     44     91     33     55     49     72     14      5     50     69     54    114
    131     55    100     74     21      0     72     70    117     59     69     67     33     46     50     27     63    108     58     48     57      8     60     34     56     82    151    155     30    108     12     36     67     90     12     21     66     52     36    132
     59     16     28      8     54     72      0      7     45     13      2    138     38    118     24     47      9     36     13    120    129     71    132    106    128     16     79     82     99     36     83    108      5     18     60     51      9    124    108     60
     62     15     31     16     52     70      7      0     48     12      6    136     37    117     26     44      8     38     13    118    127     68    131    104    127     23     82     85     96     40     82    106      6     21     59     49     14    121    106     62
     14     61     17     43     99    117     45     48      0     58     47    183     83    163     66     92     54     12     58    165    174    116    177    151    173     36     35     38    144      9    128    153     50     27    105     96     50    169    153     15
     72      4     41     17     41     59     13     12     58      0     10    125     25    105     13     34      4     49      0    107    116     58    119     93    115     26     92     95     86     49     70     95      7     31     47     38     10    111     95     73
     61     14     31     10     52     69      2      6     47     10      0    136     35    116     22     44      7     38     11    118    126     68    130    103    126     19     82     85     96     39     81    106      2     20     58     49      8    121    106     62
    198    122    167    141     84     67    138    136    183    125    136      0    100     24    118     91    129    174    125     21     13     67     17     33     17    149    218    221     40    175     58     30    133    156     79     87    133     15     30    198
     97     21     66     40     18     33     38     37     83     25     35    100      0     80     18     11     29     74     24     82     91     33     94     68     90     49    117    121     61     74     45     70     33     56     22     13     33     85     70     98
    177    102    147    120     66     46    118    117    163    105    116     24     80      0     96     73    109    154    105      4     12     49     13     13     10    128    198    201     27    154     35     12    113    136     58     67    112     12     13    178
     81     13     51     23     36     50     24     26     66     13     22    118     18     96      0     29     18     59     12     98    107     51    110     84    107     31    101    105     79     57     61     87     20     41     38     32     16    103     87     82
    106     30     75     51      7     27     47     44     92     34     44     91     11     73     29      0     37     82     33     74     83     24     86     60     83     60    126    129     52     83     40     62     41     65     17      6     43     77     61    107
     68      7     38     16     45     63      9      8     54      4      7    129     29    109     18     37      0     45      5    111    120     61    123     97    119     25     89     92     89     46     74     99      4     27     51     42     10    114     99     69
     23     52      7     36     90    108     36     38     12     49     38    174     74    154     59     82     45      0     49    156    165    107    168    142    165     31     43     46    134     10    119    144     41     17     96     87     43    159    144     24
     73      3     42     17     41     58     13     13     58      0     11    125     24    105     12     33      5     49      0    106    115     57    118     92    115     27     93     96     85     50     70     95      8     31     46     38     10    110     94     73
    179    103    149    122     67     48    120    118    165    107    118     21     82      4     98     74    111    156    106      0      9     49     13     14      9    130    200    203     25    156     37     12    115    138     60     68    114      7     12    180
    188    112    157    131     75     57    129    127    174    116    126     13     91     12    107     83    120    165    115      9      0     58      7     23      4    139    208    212     33    165     46     20    124    147     69     77    123      7     21    189
    130     54     99     74     17      8     71     68    116     58     68     67     33     49     51     24     61    107     57     49     58      0     62     35     58     83    150    153     28    107     19     37     66     89     14     19     66     52     37    131
    191    116    161    134     79     60    132    131    177    119    130     17     94     13    110     86    123    168    118     13      7     62      0     27      4    142    212    215     38    168     49     25    127    150     72     81    126     15     26    192
    165     89    134    108     52     34    106    104    151     93    103     33     68     13     84     60     97    142     92     14     23     35     27      0     23    116    185    189     14    142     24      2    101    124     46     54    100     18      3    166
    188    112    157    130     75     56    128    127    173    115    126     17     90     10    107     83    119    165    115      9      4     58      4     23      0    138    208    211     34    164     45     21    123    147     68     77    123     11     22    188
     50     30     23      9     67     82     16     23     36     26     19    149     49    128     31     60     25     31     27    130    139     83    142    116    138      0     71     74    111     27     93    119     21     17     70     63     16    134    119     51
     20     96     51     78    134    151     79     82     35     92     82    218    117    198    101    126     89     43     93    200    208    150    212    185    208     71      0      4    178     44    163    188     84     61    139    131     85    203    188     19
     24     99     54     81    137    155     82     85     38     95     85    221    121    201    105    129     92     46     96    203    212    153    215    189    211     74      4      0    181     47    166    191     87     64    143    134     89    206    191     23
    158     82    127    102     44     30     99     96    144     86     96     40     61     27     79     52     89    134     85     25     33     28     38     14     34    111    178    181      0    135     26     14     93    117     41     47     94     26     13    159
     23     53     10     34     91    108     36     40      9     49     39    175     74    154     57     83     46     10     50    156    165    107    168    142    164     27     44     47    135      0    119    145     42     19     96     88     41    160    144     24
    142     67    112     85     33     12     83     82    128     70     81     58     45     35     61     40     74    119     70     37     46     19     49     24     45     93    163    166     26    119      0     27     78    101     23     33     77     43     28    143
    168     92    137    111     55     36    108    106    153     95    106     30     70     12     87     62     99    144     95     12     20     37     25      2     21    119    188    191     14    145     27      0    103    126     48     57    103     15      1    168
     64     11     33     12     49     67      5      6     50      7      2    133     33    113     20     41      4     41      8    115    124     66    127    101    123     21     84     87     93     42     78    103      0     23     55     46      8    118    103     65
     41     34     10     19     72     90     18     21     27     31     20    156     56    136     41     65     27     17     31    138    147     89    150    124    147     17     61     64    117     19    101    126     23      0     78     69     25    142    126     42
    119     44     88     62     14     12     60     59    105     47     58     79     22     58     38     17     51     96     46     60     69     14     72     46     68     70    139    143     41     96     23     48     55     78      0     11     54     64     48    120
    111     35     80     54      5     21     51     49     96     38     49     87     13     67     32      6     42     87     38     68     77     19     81     54     77     63    131    134     47     88     33     57     46     69     11      0     46     72     56    111
     65     14     35      7     50     66      9     14     50     10      8    133     33    112     16     43     10     43     10    114    123     66    126    100    123     16     85     89     94     41     77    103      8     25     54     46      0    118    103     65
    183    107    152    126     69     52    124    121    169    111    121     15     85     12    103     77    114    159    110      7      7     52     15     18     11    134    203    206     26    160     43     15    118    142     64     72    118      0     15    184
    167     91    137    110     54     36    108    106    153     95    106     30     70     13     87     61     99    144     94     12     21     37     26      3     22    119    188    191     13    144     28      1    103    126     48     56    103     15      0    168
      1     76     31     58    114    132     60     62     15     73     62    198     98    178     82    107     69     24     73    180    189    131    192    166    188     51     19     23    159     24    143    168     65     42    120    111     65    184    168      0