# bench EOLE photo, generated by bep version 0.1, generation model "A"
bEpInstance_A_45_25
     45     25    100   1000     30     60     50    250    100    4.0
      1     94    806     31    706    906    246
      2     32    993     60    893   1093    219
      3     10    582     51    482    682    152
      4    100    752     53    652    852    239
      5    100     50     53    -50    150    147
      6     74    537     60    437    637     90
      7     66    899     50    799    999    208
      8     72    234     38    134    334    181
      9      4    326     49    226    426    123
     10     32    628     36    528    728    134
     11     21    913     58    813   1013     90
     12     67    672     34    572    772    181
     13     72    916     34    816   1016    143
     14     45    141     50     41    241     72
     15      4    314     57    214    414    201
     16     55    183     42     83    283    168
     17     51     37     59    -63    137    216
     18     67    166     37     66    266    225
     19      7    179     32     79    279    199
     20     85    219     42    119    319    165
     21     13    540     31    440    640    167
     22     68    704     51    604    804    195
     23      1    597     44    497    697    163
     24     78    882     34    782    982    108
     25     92    110     33     10    210    167
     26     27    368     44    268    468    121
     27     55    537     33    437    637    130
     28     76    498     60    398    598    229
     29      3     11     44    -89    111    194
     30     72    175     43     75    275    197
     31     77    917     39    817   1017    161
     32     80    455     56    355    555    194
     33     57    963     39    863   1063    219
     34     33    764     36    664    864    226
     35     30    299     38    199    399     61
     36     80    250     59    150    350    217
     37     26    427     47    327    527    246
     38     60    995     51    895   1095    125
     39     92      9     58    -91    109    192
     40     46    772     43    672    872     56
     41     74    730     57    630    830     63
     42     49     73     59    -27    173    209
     43     37    221     56    121    321     84
     44     47    801     30    701    901    197
     45     23    559     51    459    659    216
      0     49     59     13    189     67     24    143    122     47     32     34     28    166    125    156    192    160    158    146     69     26     57     19    174    110     67     77    200    157     28     87     40     18    127    139     96     48    199     14     19    183    146     11     64
     49      0    102     62    236    114     24    190    166     91     20     80     21    213    169    202    239    206    203    193    113     72     99     30    221    156    114    124    245    204     22    135      9     57    173    186    141      7    246     55     66    230    193     48    108
     59    102      0     48    134     19     80     88     64     12     82     26     84    110     67    100    136    104    100     92     10     33      4     76    119     53     15     26    142    102     85     36     95     45     70     84     38    104    144     48     40    127     90     55      6
     13     62     48      0    175     54     37    129    109     35     44     21     41    153    112    142    179    146    145    133     57     14     45     32    160     97     54     63    186    144     41     74     53     17    114    125     83     61    185     14      8    170    133     18     51
    189    236    134    175      0    121    212     46     73    145    216    155    216     26     70     35     12     30     39     42    124    163    138    208     15     81    122    112     26     32    216    101    228    179     64     50     96    236     10    181    170     13     45    188    128
     67    114     19     54    121      0     90     75     55     25     94     33     94     99     58     88    125     92     91     79     15     41     23     86    106     43      4      9    132     90     95     20    106     57     60     71     30    114    132     59     48    116     79     66     13
     24     24     80     37    212     90      0    166    144     68     11     56      4    189    147    179    215    183    180    170     90     48     77      5    197    133     90    100    222    181      5    111     16     34    150    162    118     24    222     32     42    206    169     24     85
    143    190     88    129     46     75    166      0     28     99    170    109    170     24     26     13     49     17     21      4     77    117     92    162     31     35     75     66     58     14    170     55    182    132     19      4     49    190     56    134    124     40      9    141     82
    122    166     64    109     73     55    144     28      0     75    146     87    148     47      3     37     73     42     36     33     53     95     67    140     58     11     54     46     78     41    148     37    159    109      9     26     25    167     82    111    102     64     27    119     58
     47     91     12     35    145     25     68     99     75      0     71     14     72    121     78    111    147    115    112    103     22     21     10     64    130     65     23     34    154    113     73     44     83     34     82     95     50     92    155     36     27    138    101     43     17
     32     20     82     44    216     94     11    170    146     71      0     61     12    193    149    182    219    187    183    174     93     53     79     16    201    136     94    104    225    184     14    115     15     37    153    166    121     22    226     35     47    210    173     28     88
     34     80     26     21    155     33     56    109     87     14     61      0     61    132     90    122    158    126    124    113     35      8     24     52    140     76     33     43    166    124     61     54     72     24     93    105     62     80    165     25     14    149    112     32     30
     28     21     84     41    216     94      4    170    148     72     12     61      0    193    151    183    219    187    184    174     95     53     81      8    201    137     94    104    226    185      1    115     12     39    154    166    122     19    226     36     46    210    173     29     90
    166    213    110    153     26     99    189     24     47    121    193    132    193      0     44     10     26      8     13     21    100    140    114    185     14     56     99     89     34     10    194     78    205    155     39     28     71    213     35    157    147     17     20    165    104
    125    169     67    112     70     58    147     26      3     78    149     90    151     44      0     35     70     40     33     31     56     98     70    143     55     14     57     49     75     38    151     40    162    112      7     24     28    170     79    114    105     61     24    122     61
    156    202    100    142     35     88    179     13     37    111    182    122    183     10     35      0     36      5     12     11     89    130    104    174     20     46     88     78     44      4    183     68    195    145     29     17     61    203     44    147    136     27     10    154     94
    192    239    136    179     12    125    215     49     73    147    219    158    219     26     70     36      0     32     37     46    126    166    140    211     20     82    125    115     13     34    220    104    231    181     65     53     97    239     12    183    173      9     46    191    130
    160    206    104    146     30     92    183     17     42    115    187    126    187      8     40      5     32      0     15     13     94    134    109    179     15     51     92     83     41      2    187     72    199    149     34     21     66    207     39    151    141     23     15    158     98
    158    203    100    145     39     91    180     21     36    112    183    124    184     13     33     12     37     15      0     21     90    132    104    176     27     47     90     81     42     16    185     71    196    146     30     25     62    204     47    148    138     28     12    155     95
    146    193     92    133     42     79    170      4     33    103    174    113    174     21     31     11     46     13     21      0     82    121     96    165     27     39     79     69     55     11    174     59    186    136     24      7     54    194     52    138    127     37     12    145     86
     69    113     10     57    124     15     90     77     53     22     93     35     95    100     56     89    126     94     90     82      0     43     14     87    109     43     10     18    132     92     95     27    106     56     60     74     28    114    134     58     49    117     79     65      5
     26     72     33     14    163     41     48    117     95     21     53      8     53    140     98    130    166    134    132    121     43      0     31     44    148     84     41     51    174    132     53     62     64     17    101    113     70     72    173     17      6    157    120     24     37
     57     99      4     45    138     23     77     92     67     10     79     24     81    114     70    104    140    109    104     96     14     31      0     73    123     57     20     31    146    106     82     40     92     42     74     88     42    100    148     45     37    131     94     52     10
     19     30     76     32    208     86      5    162    140     64     16     52      8    185    143    174    211    179    176    165     87     44     73      0    193    129     86     96    218    176      8    106     20     31    146    158    114     28    218     28     38    202    165     21     81
    174    221    119    160     15    106    197     31     58    130    201    140    201     14     55     20     20     15     27     27    109    148    123    193      0     66    107     97     33     17    201     86    213    164     49     35     80    221     25    165    155     14     30    173    113
    110    156     53     97     81     43    133     35     11     65    136     76    137     56     14     46     82     51     47     39     43     84     57    129     66      0     42     34     89     49    137     25    148     99     17     32     14    156     91    101     91     73     36    108     47
     67    114     15     54    122      4     90     75     54     23     94     33     94     99     57     88    125     92     90     79     10     41     20     86    107     42      0     11    132     90     95     21    106     57     59     72     28    114    132     58     48    116     79     66      9
     77    124     26     63    112      9    100     66     46     34    104     43    104     89     49     78    115     83     81     69     18     51     31     96     97     34     11      0    123     80    104     10    116     67     51     62     21    124    122     68     58    106     69     76     20
    200    245    142    186     26    132    222     58     78    154    225    166    226     34     75     44     13     41     42     55    132    174    146    218     33     89    132    123      0     44    227    112    238    188     72     62    104    246     22    190    180     19     53    197    137
    157    204    102    144     32     90    181     14     41    113    184    124    185     10     38      4     34      2     16     11     92    132    106    176     17     49     90     80     44      0    185     70    197    147     32     18     64    205     41    149    138     26     14    156     96
     28     22     85     41    216     95      5    170    148     73     14     61      1    194    151    183    220    187    185    174     95     53     82      8    201    137     95    104    227    185      0    115     12     39    154    166    123     19    227     37     46    211    174     29     90
     87    135     36     74    101     20    111     55     37     44    115     54    115     78     40     68    104     72     71     59     27     62     40    106     86     25     21     10    112     70    115      0    127     78     40     51     15    135    111     79     68     95     59     86     29
     40      9     95     53    228    106     16    182    159     83     15     72     12    205    162    195    231    199    196    186    106     64     92     20    213    148    106    116    238    197     12    127      0     50    166    178    134      8    238     47     58    222    185     40    101
     18     57     45     17    179     57     34    132    109     34     37     24     39    155    112    145    181    149    146    136     56     17     42     31    164     99     57     67    188    147     39     78     50      0    116    129     84     58    189      3     13    172    135      9     51
    127    173     70    114     64     60    150     19      9     82    153     93    154     39      7     29     65     34     30     24     60    101     74    146     49     17     59     51     72     32    154     40    166    116      0     17     32    174     74    118    108     56     19    125     65
    139    186     84    125     50     71    162      4     26     95    166    105    166     28     24     17     53     21     25      7     74    113     88    158     35     32     72     62     62     18    166     51    178    129     17      0     46    186     60    130    120     44     12    137     78
     96    141     38     83     96     30    118     49     25     50    121     62    122     71     28     61     97     66     62     54     28     70     42    114     80     14     28     21    104     64    123     15    134     84     32     46      0    142    105     86     76     88     51     93     33
     48      7    104     61    236    114     24    190    167     92     22     80     19    213    170    203    239    207    204    194    114     72    100     28    221    156    114    124    246    205     19    135      8     58    174    186    142      0    246     55     66    230    193     48    109
    199    246    144    185     10    132    222     56     82    155    226    165    226     35     79     44     12     39     47     52    134    173    148    218     25     91    132    122     22     41    227    111    238    189     74     60    105    246      0    191    180     19     54    198    138
     14     55     48     14    181     59     32    134    111     36     35     25     36    157    114    147    183    151    148    138     58     17     45     28    165    101     58     68    190    149     37     79     47      3    118    130     86     55    191      0     12    174    137      7     53
     19     66     40      8    170     48     42    124    102     27     47     14     46    147    105    136    173    141    138    127     49      6     37     38    155     91     48     58    180    138     46     68     58     13    108    120     76     66    180     12      0    164    127     18     44
    183    230    127    170     13    116    206     40     64    138    210    149    210     17     61     27      9     23     28     37    117    157    131    202     14     73    116    106     19     26    211     95    222    172     56     44     88    230     19    174    164      0     37    182    121
    146    193     90    133     45     79    169      9     27    101    173    112    173     20     24     10     46     15     12     12     79    120     94    165     30     36     79     69     53     14    174     59    185    135     19     12     51    193     54    137    127     37      0    145     84
     11     48     55     18    188     66     24    141    119     43     28     32     29    165    122    154    191    158    155    145     65     24     52     21    173    108     66     76    197    156     29     86     40      9    125    137     93     48    198      7     18    182    145      0     60
     64    108      6     51    128     13     85     82     58     17     88     30     90    104     61     94    130     98     95     86      5     37     10     81    113     47      9     20    137     96     90     29    101     51     65     78     33    109    138     53     44    121     84     60      0