# bench EOLE photo, generated by bep version 0.1, generation model "A"
bEpInstance_A_30_50
     30     50    100   1000     30     60     50    250    100    4.0
      1     90    629     33    529    729    246
      2     67    508     30    408    608     93
      3     23    191     43     91    291    160
      4      1     38     30    -62    138    235
      5     52    648     32    548    748    154
      6     54    130     31     30    230    243
      7     38    866     41    766    966    182
      8     51    561     50    461    661    130
      9     19    769     41    669    869    223
     10     27    393     32    293    493    152
     11     59    508     31    408    608    170
     12     55     84     46    -16    184     63
     13     73    613     48    513    713    104
     14     75    645     37    545    745     75
     15     51    615     54    515    715     53
     16     17    454     43    354    554    123
     17     22    797     37    697    897    150
     18     19    304     30    204    404    205
     19     82     70     41    -30    170    121
     20     15    897     43    797    997    228
     21     51     11     34    -89    111    100
     22     66    394     41    294    494     83
     23      0    169     35     69    269     87
     24     62    603     47    503    703    220
     25     40    779     40    679    879    168
     26      8    355     41    255    455    229
     27     42    741     37    641    841    166
     28     64    677     44    577    777     79
     29     69    624     42    524    724    119
     30      1    780     45    680    880     55
      0     30    110    149     10    125     60     19     39     61     31    136      5      5     10     47     45     83    139     69    154     59    117      9     39     71     30     13      5     43
     30      0     80    118     35     94     89     13     66     30      2    106     26     34     27     18     73     52    109     98    124     28     86     23     68     40     58     42     29     69
    110     80      0     38    114     17    168     92    144     50     79     27    106    114    106     65    151     28     33    176     45     51      7    103    147     41    137    121    108    147
    149    118     38      0    153     26    207    131    182     88    118     17    144    152    144    104    189     66     21    214     14     90     32    142    185     79    176    160    147    185
     10     35    114    153      0    129     54     21     31     64     35    141     10      5      8     49     37     86    144     62    159     63    120     11     32     74     23      7      7     35
    125     94     17     26    129      0    184    107    159     66     94     11    120    128    121     81    166     44     16    191     29     66     16    118    162     57    152    136    123    163
     60     89    168    207     54    184      0     76     24    118     89    195     63     56     62    103     17    140    199      9    213    118    174     66     21    127     31     47     60     23
     19     13     92    131     21    107     76      0     52     42     13    119     14     21     13     28     59     64    122     84    137     41     98     10     54     52     45     29     16     56
     39     66    144    182     31    159     24     52      0     94     66    171     41     34     39     78      7    116    175     32    189     94    150     42      5    103      9     25     38      5
     61     30     50     88     64     66    118     42     94      0     29     77     56     64     55     15    101     22     81    126     95      9     56     53     96     10     87     71     58     96
     31      2     79    118     35     94     89     13     66     29      0    106     26     34     26     17     72     51    109     97    124     28     86     23     67     40     58     42     29     69
    136    106     27     17    141     11    195    119    171     77    106      0    132    140    132     92    178     55      7    203     18     77     25    129    173     68    164    148    135    174
      5     26    106    144     10    120     63     14     41     56     26    132      0      8      5     42     47     78    135     72    150     54    112      3     42     66     32     16      2     45
      5     34    114    152      5    128     56     21     34     64     34    140      8      0      9     49     40     86    143     64    158     62    120     10     34     74     25      8      5     38
     10     27    106    144      8    121     62     13     39     55     26    132      5      9      0     41     46     78    136     71    151     55    112      4     41     65     31     15      5     43
     47     18     65    104     49     81    103     28     78     15     17     92     42     49     41      0     85     37     97    110    111     19     71     38     81     24     72     56     44     81
     45     73    151    189     37    166     17     59      7    101     72    178     47     40     46     85      0    123    182     25    196    101    157     49      6    110     14     31     44      6
     83     52     28     66     86     44    140     64    116     22     51     55     78     86     78     37    123      0     60    148     73     25     34     75    118     13    109     93     80    119
    139    109     33     21    144     16    199    122    175     81    109      7    135    143    136     97    182     60      0    207     16     81     32    133    177     73    168    151    138    178
     69     98    176    214     62    191      9     84     32    126     97    203     72     64     71    110     25    148    207      0    221    126    182     74     30    135     39     56     69     29
    154    124     45     14    159     29    213    137    189     95    124     18    150    158    151    111    196     73     16    221      0     95     41    148    192     86    182    166    153    192
     59     28     51     90     63     66    118     41     94      9     28     77     54     62     55     19    101     25     81    126     95      0     58     52     96     17     86     70     57     97
    117     86      7     32    120     16    174     98    150     56     86     25    112    120    112     71    157     34     32    182     41     58      0    109    152     46    143    128    115    152
      9     23    103    142     11    118     66     10     42     53     23    129      3     10      4     38     49     75    133     74    148     52    109      0     44     63     34     18      5     46
     39     68    147    185     32    162     21     54      5     96     67    173     42     34     41     81      6    118    177     30    192     96    152     44      0    106      9     26     39      9
     71     40     41     79     74     57    127     52    103     10     40     68     66     74     65     24    110     13     73    135     86     17     46     63    106      0     96     81     68    106
     30     58    137    176     23    152     31     45      9     87     58    164     32     25     31     72     14    109    168     39    182     86    143     34      9     96      0     16     30     14
     13     42    121    160      7    136     47     29     25     71     42    148     16      8     15     56     31     93    151     56    166     70    128     18     26     81     16      0     13     30
      5     29    108    147      7    123     60     16     38     58     29    135      2      5      5     44     44     80    138     69    153     57    115      5     39     68     30     13      0     42
     43     69    147    185     35    163     23     56      5     96     69    174     45     38     43     81      6    119    178     29    192     97    152     46      9    106     14     30     42      0