# bench EOLE photo, generated by bep version 0.1, generation model "A"
bEpInstance_A_10_10
     10     10    100   1000     30     60     50    250    100    4.0
      1     57    611     45    511    711     86
      2     82    183     48     83    283    134
      3      2    316     31    216    416     66
      4     98    979     57    879   1079     60
      5     27     92     57     -8    192    163
      6     67    982     59    882   1082     78
      7     22    214     30    114    314    224
      8     33    536     47    436    636    230
      9     14     62     32    -38    162    243
     10     24    662     41    562    762    104
      0    107     75     92    129     92     99     19    137     15
    107      0     38    199     26    199     16     89     34    120
     75     38      0    167     56    167     25     55     63     86
     92    199    167      0    222      7    192    111    230     81
    129     26     56    222      0    222     30    111      8    142
     92    199    167      7    222      0    192    111    230     80
     99     16     25    192     30    192      0     80     38    112
     19     89     55    111    111    111     80      0    118     31
    137     34     63    230      8    230     38    118      0    150
     15    120     86     81    142     80    112     31    150      0