# bench EOLE photo, generated by bep version 0.1, generation model "A"
bEpInstance_A_25_48
     25     48    100   1000     30     60     50    250    100    4.0
      1     69    309     30    209    409    118
      2     81    575     39    475    675     76
      3     64     33     43    -67    133    198
      4     22    948     31    848   1048     53
      5     17    637     36    537    737    193
      6     42     44     50    -56    144    199
      7     96    433     45    333    533    211
      8     35    968     44    868   1068     57
      9     27    478     41    378    578     67
     10      5    683     36    583    783    188
     11     72    644     43    544    744    239
     12     59    480     59    380    580    203
     13     11    184     44     84    284    157
     14     23    152     38     52    252     86
     15     59    768     60    668    868    238
     16     74    455     60    355    555     52
     17     94    356     33    256    456    248
     18      3    321     50    221    421    201
     19     97     97     51     -3    197    161
     20     58    658     39    558    758    189
     21     85    800     37    700    900     64
     22     96    508     37    408    608    157
     23     27    236     44    136    336     52
     24     69    450     30    350    550    175
     25     81    121     48     21    221    219
      0     66     69    160     83     66     31    164     43     94     83     42     34     40    114     36     13     16     53     87    122     50     21     35     47
     66      0    135     94     22    133     35     98     27     33     17     24     99    106     48     30     54     66    119     21     56     17     85     31    113
     69    135      0    228    151      6    100    233    111    163    152    111     40     31    183    105     81     73     18    156    191    119     51    104     22
    160     94    228      0     77    226    130      5    117     66     77    117    191    199     45    123    149    156    213     73     40    111    178    125    207
     83     22    151     77      0    148     54     82     39     11     13     40    113    121     34     47     72     79    136     11     44     37    100     48    129
     66    133      6    226    148      0     98    231    108    160    150    109     35     27    181    103     79     69     19    153    189    116     48    101     21
     31     35    100    130     54     98      0    134     20     66     53     14     65     72     84      7     19     36     84     57     91     18     52      7     78
    164     98    233      5     82    231    134      0    122     71     81    122    196    204     50    128    153    161    218     77     43    116    183    129    212
     43     27    111    117     39    108     20    122      0     51     42      8     73     81     72     13     34     39     96     45     81     18     60     12     90
     94     33    163     66     11    160     66     71     51      0     19     52    124    132     25     59     84     90    148     14     35     49    111     60    141
     83     17    152     77     13    150     53     81     42     19      0     41    116    123     31     47     72     82    136      4     39     34    102     48    130
     42     24    111    117     40    109     14    122      8     52     41      0     74     82     72      7     32     42     96     44     80     11     61      7     89
     34     99     40    191    113     35     65    196     73    124    116     74      0      8    146     69     47     34     30    119    155     83     13     68     23
     40    106     31    199    121     27     72    204     81    132    123     82      8      0    154     76     54     42     23    126    162     90     21     75     16
    114     48    183     45     34    181     84     50     72     25     31     72    146    154      0     78    103    112    168     27     10     65    133     79    161
     36     30    105    123     47    103      7    128     13     59     47      7     69     76     78      0     25     37     89     50     86     14     55      1     83
     13     54     81    149     72     79     19    153     34     84     72     32     47     54    103     25      0     24     64     76    111     38     34     24     58
     16     66     73    156     79     69     36    161     39     90     82     42     34     42    112     37     24      0     60     85    121     52     22     36     53
     53    119     18    213    136     19     84    218     96    148    136     96     30     23    168     89     64     60      0    140    175    102     38     88      7
     87     21    156     73     11    153     57     77     45     14      4     44    119    126     27     50     76     85    140      0     36     38    105     52    134
    122     56    191     40     44    189     91     43     81     35     39     80    155    162     10     86    111    121    175     36      0     73    141     87    169
     50     17    119    111     37    116     18    116     18     49     34     11     83     90     65     14     38     52    102     38     73      0     70     15     96
     21     85     51    178    100     48     52    183     60    111    102     61     13     21    133     55     34     22     38    105    141     70      0     54     31
     35     31    104    125     48    101      7    129     12     60     48      7     68     75     79      1     24     36     88     52     87     15     54      0     82
     47    113     22    207    129     21     78    212     90    141    130     89     23     16    161     83     58     53      7    134    169     96     31     82      0