# bench EOLE photo, generated by bep version 0.1, generation model "A"
bEpInstance_A_40_16
     40     16    100   1000     30     60     50    250    100    4.0
      1     21     89     39    -11    189    170
      2     93      8     37    -92    108    189
      3     36    823     33    723    923    161
      4     38    288     55    188    388    112
      5     86    679     31    579    779     56
      6      9    305     35    205    405    123
      7     10    590     38    490    690     58
      8     89    921     53    821   1021     70
      9      1     73     51    -27    173    237
     10      8    951     49    851   1051    138
     11     78    742     60    642    842     81
     12      3    819     44    719    919    228
     13     50    506     58    406    606    169
     14     81    100     59      0    200    233
     15     69    234     59    134    334    165
     16     15    703     50    603    803     83
     17     78    377     32    277    477    222
     18     33    719     39    619    819     70
     19     46    291     38    191    391    148
     20     11    726     41    626    826    172
     21     23    300     36    200    400     58
     22     40    165     59     65    265     67
     23     40    904     50    804   1004    161
     24     61    341     52    241    441    126
     25     72    813     37    713    913     59
     26     53    536     34    436    636    249
     27     83    408     44    308    508    238
     28     13    859     46    759    959    123
     29     16    748     42    648    848    162
     30     92    359     50    259    459    112
     31     26    312     56    212    412    224
     32     66    582     37    482    682    124
     33     39    491     43    391    591    236
     34      2    568     58    468    668    221
     35     98    398     54    298    498     71
     36     25    336     44    236    436    133
     37      8    880     60    780    980    250
     38     24    622     39    522    722    151
     39     94    171     41     71    271    168
     40     76    625     59    525    725     79
      0     27    183     49    148     54    125    208      6    215    163    182    104     15     38    153     73    157     50    159     52     19    203     63    181    112     81    192    164     69     55    123    100    119     79     61    197    133     27    134
     27      0    204     71    167     77    146    228     28    236    183    203    124     23     56    174     92    178     71    180     75     41    224     83    201    132    100    213    185     87     77    143    121    141     97     83    219    154     40    154
    183    204      0    133     38    129     58     27    187     32     22      8     79    181    147     30    111     26    133     25    130    164     20    120      9     71    104     10     19    116    127     60     83     64    107    121     15     50    163     50
     49     71    133      0     98      8     75    158     54    165    113    133     54     48     15    103     24    107      2    109      4     30    154     14    131     62     32    142    115     22      6     73     50     70     31     12    148     83     32     84
    148    167     38     98      0     95     29     60    152     70     15     40     44    144    111     18     75     16     97     22     96    129     57     84     33     36     67     48     24     80     92     24     48     34     70     87     53     21    127     13
     54     77    129      8     95      0     71    155     58    161    110    128     51     54     23     99     24    103      9    105      3     35    149     15    127     58     31    138    110     24      4     70     47     65     32      8    143     79     39     81
    125    146     58     75     29     71      0     85    129     90     41     57     23    123     90     28     55     32     75     34     72    106     78     63     57     17     49     67     39     61     69     14     25      5     52     63     72      8    106     18
    208    228     27    158     60    155     85      0    213     21     44     33    104    205    171     57    136     52    157     52    156    189     12    145     27     96    128     24     46    140    153     84    108     90    130    147     22     76    187     74
      6     28    187     54    152     58    129    213      0    219    168    186    108     21     43    157     78    161     55    163     57     24    207     68    185    116     86    196    168     75     60    128    104    123     84     66    201    137     33    139
    215    236     32    165     70    161     90     21    219      0     55     33    111    213    179     62    144     58    165     56    162    196     14    153     38    104    137     23     50    149    159     93    115     95    140    153     17     82    196     83
    163    183     22    113     15    110     41     44    168     55      0     26     59    160    127     18     91     12    113     17    111    144     41    100     17     51     83     33     15     95    108     40     63     47     86    102     38     32    142     29
    182    203      8    133     40    128     57     33    186     33     26      0     79    180    147     29    112     26    132     23    129    163     23    120     17     71    104     10     18    117    126     61     82     62    107    120     15     49    163     51
    104    124     79     54     44     51     23    104    108    111     59     79      0    101     68     50     33     53     53     55     51     85     99     41     76      7     25     88     61     38     48     19      4     19     29     42     94     29     84     30
     15     23    181     48    144     54    123    205     21    213    160    180    101      0     33    151     69    155     48    157     52     19    201     60    178    109     77    190    162     64     54    120     98    118     74     60    195    131     18    131
     38     56    147     15    111     23     90    171     43    179    127    147     68     33      0    118     35    121     15    123     20     18    167     26    144     75     43    156    129     31     22     87     64     85     41     27    162     97     16     97
    153    174     30    103     18     99     28     57    157     62     18     29     50    151    118      0     83      6    103      5    100    134     50     91     30     42     75     39     11     88     97     32     53     33     79     91     44     20    134     24
     73     92    111     24     75     24     55    136     78    144     91    112     33     69     35     83      0     86     22     88     23     53    132      9    109     40      7    121     94      5     20     51     30     51      7     16    126     62     51     62
    157    178     26    107     16    103     32     52    161     58     12     26     53    155    121      6     86      0    107      5    104    138     46     94     25     46     78     35      8     91    101     35     57     38     81     95     40     24    137     25
     50     71    133      2     97      9     75    157     55    165    113    132     53     48     15    103     22    107      0    109      6     31    153     13    130     61     30    142    114     20      7     72     50     70     29     12    147     82     32     83
    159    180     25    109     22    105     34     52    163     56     17     23     55    157    123      5     88      5    109      0    106    140     45     97     26     48     81     33      5     93    103     38     59     39     84     97     38     26    140     30
     52     75    130      4     96      3     72    156     57    162    111    129     51     52     20    100     23    104      6    106      0     34    151     13    128     59     30    139    112     22      3     71     47     67     30      9    145     80     36     82
     19     41    164     30    129     35    106    189     24    196    144    163     85     19     18    134     53    138     31    140     34      0    184     44    162     92     61    173    145     50     36    104     81    101     60     42    178    114     13    115
    203    224     20    154     57    149     78     12    207     14     41     23     99    201    167     50    132     46    153     45    151    184      0    140     24     92    124     13     39    136    148     80    103     84    127    142     10     70    183     70
     63     83    120     14     84     15     63    145     68    153    100    120     41     60     26     91      9     94     13     97     13     44    140      0    118     48     17    130    102      8     11     60     37     58     16      9    135     70     43     71
    181    201      9    131     33    127     57     27    185     38     17     17     76    178    144     30    109     25    130     26    128    162     24    118      0     69    101     18     21    113    125     57     80     63    103    119     23     49    160     47
    112    132     71     62     36     58     17     96    116    104     51     71      7    109     75     42     40     46     61     48     59     92     92     48     69      0     32     81     53     45     56     11     11     15     36     50     86     22     91     22
     81    100    104     32     67     31     49    128     86    137     83    104     25     77     43     75      7     78     30     81     30     61    124     17    101     32      0    114     86     12     27     43     23     44      4     23    119     55     59     54
    192    213     10    142     48    138     67     24    196     23     33     10     88    190    156     39    121     35    142     33    139    173     13    130     18     81    114      0     27    126    136     70     92     72    117    130      5     59    173     60
    164    185     19    115     24    110     39     46    168     50     15     18     61    162    129     11     94      8    114      5    112    145     39    102     21     53     86     27      0     99    109     43     64     45     89    103     33     31    145     34
     69     87    116     22     80     24     61    140     75    149     95    117     38     64     31     88      5     91     20     93     22     50    136      8    113     45     12    126     99      0     20     56     35     56      9     17    131     67     47     66
     55     77    127      6     92      4     69    153     60    159    108    126     48     54     22     97     20    101      7    103      3     36    148     11    125     56     27    136    109     20      0     68     44     64     28      6    142     77     39     79
    123    143     60     73     24     70     14     84    128     93     40     61     19    120     87     32     51     35     72     38     71    104     80     60     57     11     43     70     43     56     68      0     23     16     46     62     75     14    102     11
    100    121     83     50     48     47     25    108    104    115     63     82      4     98     64     53     30     57     50     59     47     81    103     37     80     11     23     92     64     35     44     23      0     21     27     38     97     32     81     34
    119    141     64     70     34     65      5     90    123     95     47     62     19    118     85     33     51     38     70     39     67    101     84     58     63     15     44     72     45     56     64     16     21      0     48     58     78     14    101     23
     79     97    107     31     70     32     52    130     84    140     86    107     29     74     41     79      7     81     29     84     30     60    127     16    103     36      4    117     89      9     28     46     27     48      0     23    122     58     56     57
     61     83    121     12     87      8     63    147     66    153    102    120     42     60     27     91     16     95     12     97      9     42    142      9    119     50     23    130    103     17      6     62     38     58     23      0    136     71     44     73
    197    219     15    148     53    143     72     22    201     17     38     15     94    195    162     44    126     40    147     38    145    178     10    135     23     86    119      5     33    131    142     75     97     78    122    136      0     64    178     65
    133    154     50     83     21     79      8     76    137     82     32     49     29    131     97     20     62     24     82     26     80    114     70     70     49     22     55     59     31     67     77     14     32     14     58     71     64      0    114     13
     27     40    163     32    127     39    106    187     33    196    142    163     84     18     16    134     51    137     32    140     36     13    183     43    160     91     59    173    145     47     39    102     81    101     56     44    178    114      0    113
    134    154     50     84     13     81     18     74    139     83     29     51     30    131     97     24     62     25     83     30     82    115     70     71     47     22     54     60     34     66     79     11     34     23     57     73     65     13    113      0