# bench EOLE photo, generated by bep version 0.1, generation model "A"
bEpInstance_A_40_5
     40      5    100   1000     30     60     50    250    100    4.0
      1     27     46     60    -54    146     66
      2     14     79     38    -21    179    140
      3     50    894     30    794    994    105
      4     98    221     42    121    321    101
      5     36    272     42    172    372    101
      6     30    461     43    361    561    107
      7      7    822     59    722    922    128
      8     37    970     44    870   1070    180
      9      1    470     52    370    570     82
     10     55      8     48    -92    108     59
     11     91    628     40    528    728    225
     12     85    739     34    639    839     92
     13      1    547     44    447    647    113
     14      0    921     48    821   1021     66
     15     74    565     44    465    665     73
     16     53    954     53    854   1054    160
     17     42    492     52    392    592    245
     18     50    326     30    226    426    131
     19     96    344     38    244    444    211
     20      8    409     30    309    509     68
     21     96    485     42    385    585    243
     22     40      7     31    -93    107     79
     23     57    523     38    423    623     71
     24     48     26     50    -74    126    230
     25     52    370     57    270    470     54
     26     70    894     43    794    994    180
     27     24    703     44    603    803    114
     28     11    472     42    372    572     63
     29     96    823     30    723    923    122
     30     83     78     45    -22    178    130
     31     60    773     45    673    873     65
     32     80    163     60     63    263    113
     33     53    851     40    751    951     96
     34     75    763     57    663    863    247
     35     46    337     39    237    437    165
     36     81    719     49    619    819    203
     37     54    675     33    575    775    124
     38     76    638     53    538    738    121
     39     41    279     43    179    379     92
     40     44    410     46    310    510    246
      0      8    212     47     56    103    194    231    106     11    146    173    125    218    130    227    111     70     76     90    111     10    119      7     81    212    164    106    195     16    181     32    201    179     72    168    157    148     58     91
      8      0    203     41     48     95    185    222     97     20    138    165    117    210    122    218    103     62     69     82    103     19    111     15     73    204    156     98    187     17    173     26    193    171     64    160    149    140     50     83
    212    203      0    168    155    108     20     19    106    221     67     39     87     14     82     15    100    142    137    121    102    221     92    217    131      5     48    105     21    204     30    182     10     33    139     44     54     64    153    121
     47     41    168      0     20     62    151    187     66     54    101    129     85    176     86    183     69     28     30     52     66     55     76     50     38    168    121     66    150     35    138     15    157    135     31    124    114    104     20     49
     56     48    155     20      0     47    137    174     50     66     90    117     69    162     73    170     55     13     23     34     55     66     62     61     24    155    107     50    138     49    125     29    144    123     16    112    100     92      2     34
    103     95    108     62     47      0     90    127      7    113     44     70     22    115     28    123      8     34     33     14     17    113     16    108     23    108     60      5     91     96     78     75     97     76     31     65     53     45     45     13
    194    185     20    151    137     90      0     37     88    203     52     28     68     24     66     34     82    124    121    103     87    203     75    199    113     23     30     87     22    186     18    165     13     22    121     31     38     49    136    103
    231    222     19    187    174    127     37      0    125    240     86     58    106     15    101      5    119    161    157    140    122    240    111    236    150     20     66    124     39    223     49    202     30     52    158     63     73     83    172    140
    106     97    106     66     50      7     88    125      0    116     45     70     19    112     29    121     11     38     39     15     24    116     19    111     28    107     58      2     91    100     77     79     96     75     35     65     52     45     48     18
     11     20    221     54     66    113    203    240    116      0    155    182    135    228    139    236    121     79     84    100    119      3    128      4     90    221    173    116    204     18    191     39    210    188     82    177    166    157     67    100
    146    138     67    101     90     44     52     86     45    155      0     27     30     76     16     82     36     76     71     58     35    155     27    150     65     66     25     43     48    137     37    116     56     33     73     22     14      4     88     55
    173    165     39    129    117     70     28     58     70    182     27      0     52     50     43     54     62    103     98     84     63    183     54    178     92     38     17     69     21    165     10    144     29      6    100      5     17     25    115     82
    125    117     87     85     69     22     68    106     19    135     30     52      0     93     18    102     17     56     56     34     28    135     15    130     46     88     39     18     72    119     58     98     77     57     53     47     34     29     67     35
    218    210     14    176    162    115     24     15    112    228     76     50     93      0     90     15    107    149    146    128    111    228    100    224    138     18     54    112     34    211     39    190     21     43    146     54     62     73    160    128
    130    122     82     86     73     28     66    101     29    139     16     43     18     90      0     97     19     60     55     42     20    139     11    134     49     82     36     28     64    121     52    100     71     49     57     38     27     18     71     39
    227    218     15    183    170    123     34      5    121    236     82     54    102     15     97      0    115    157    152    136    117    236    107    232    146     15     63    120     34    219     45    197     25     48    154     59     69     79    168    136
    111    103    100     69     55      8     82    119     11    121     36     62     17    107     19    115      0     41     39     22     13    121      8    116     30    100     52      9     83    104     70     82     89     68     38     57     45     37     53     20
     70     62    142     28     13     34    124    161     38     79     76    103     56    149     60    157     41      0     12     23     41     79     49     75     11    142     94     37    124     62    111     41    131    109      2     98     87     78     11     21
     76     69    137     30     23     33    121    157     39     84     71     98     56    146     55    152     39     12      0     27     35     85     45     80     12    137     91     38    119     66    107     45    127    104     12     93     83     73     21     21
     90     82    121     52     34     14    103    140     15    100     58     84     34    128     42    136     22     23     27      0     29    100     31     96     14    122     73     15    105     84     91     64    111     90     20     79     67     59     33      9
    111    103    102     66     55     17     87    122     24    119     35     63     28    111     20    117     13     41     35     29      0    120     13    115     30    102     57     21     84    101     72     80     92     69     39     58     48     38     53     22
     10     19    221     55     66    113    203    240    116      3    155    183    135    228    139    236    121     79     85    100    120      0    129      5     90    221    174    116    204     20    191     40    211    189     82    178    167    158     68    100
    119    111     92     76     62     16     75    111     19    128     27     54     15    100     11    107      8     49     45     31     13    129      0    124     38     92     45     17     75    111     62     90     82     60     46     49     38     29     61     28
      7     15    217     50     61    108    199    236    111      4    150    178    130    224    134    232    116     75     80     96    115      5    124      0     86    217    169    111    199     15    186     35    206    184     77    173    162    153     63     96
     81     73    131     38     24     23    113    150     28     90     65     92     46    138     49    146     30     11     12     14     30     90     38     86      0    131     83     27    113     73    100     52    120     98      8     87     76     67     22     10
    212    204      5    168    155    108     23     20    107    221     66     38     88     18     82     15    100    142    137    122    102    221     92    217    131      0     49    106     18    204     30    182     11     32    139     43     54     64    153    121
    164    156     48    121    107     60     30     66     58    173     25     17     39     54     36     63     52     94     91     73     57    174     45    169     83     49      0     57     34    156     19    135     37     19     91     14     10     20    106     73
    106     98    105     66     50      5     87    124      2    116     43     69     18    112     28    120      9     37     38     15     21    116     17    111     27    106     57      0     90    100     76     79     95     74     34     64     51     44     48     17
    195    187     21    150    138     91     22     39     91    204     48     21     72     34     64     34     83    124    119    105     84    204     75    199    113     18     34     90      0    186     15    165     12     15    122     26     38     46    136    104
     16     17    204     35     49     96    186    223    100     18    137    165    119    211    121    219    104     62     66     84    101     20    111     15     73    204    156    100    186      0    173     21    193    171     65    160    149    140     51     83
    181    173     30    138    125     78     18     49     77    191     37     10     58     39     52     45     70    111    107     91     72    191     62    186    100     30     19     76     15    173      0    152     19      4    109     14     24     33    123     90
     32     26    182     15     29     75    165    202     79     39    116    144     98    190    100    197     82     41     45     64     80     40     90     35     52    182    135     79    165     21    152      0    172    150     44    139    128    118     30     62
    201    193     10    157    144     97     13     30     96    210     56     29     77     21     71     25     89    131    127    111     92    211     82    206    120     11     37     95     12    193     19    172      0     22    128     33     44     53    143    110
    179    171     33    135    123     76     22     52     75    188     33      6     57     43     49     48     68    109    104     90     69    189     60    184     98     32     19     74     15    171      4    150     22      0    106     11     22     31    121     88
     72     64    139     31     16     31    121    158     35     82     73    100     53    146     57    154     38      2     12     20     39     82     46     77      8    139     91     34    122     65    109     44    128    106      0     95     84     75     14     18
    168    160     44    124    112     65     31     63     65    177     22      5     47     54     38     59     57     98     93     79     58    178     49    173     87     43     14     64     26    160     14    139     33     11     95      0     12     20    110     77
    157    149     54    114    100     53     38     73     52    166     14     17     34     62     27     69     45     87     83     67     48    167     38    162     76     54     10     51     38    149     24    128     44     22     84     12      0     10     99     66
    148    140     64    104     92     45     49     83     45    157      4     25     29     73     18     79     37     78     73     59     38    158     29    153     67     64     20     44     46    140     33    118     53     31     75     20     10      0     90     57
     58     50    153     20      2     45    136    172     48     67     88    115     67    160     71    168     53     11     21     33     53     68     61     63     22    153    106     48    136     51    123     30    143    121     14    110     99     90      0     32
     91     83    121     49     34     13    103    140     18    100     55     82     35    128     39    136     20     21     21      9     22    100     28     96     10    121     73     17    104     83     90     62    110     88     18     77     66     57     32      0