# bench EOLE photo, generated by bep version 0.1, generation model "A"
bEpInstance_A_20_7
     20      7    100   1000     30     60     50    250    100    4.0
      1     49    868     48    768    968     93
      2      1    515     60    415    615     56
      3     60     55     46    -45    155     67
      4     77    816     57    716    916     82
      5     21    788     54    688    888     63
      6     43     53     40    -47    153    152
      7      1    261     41    161    361    202
      8      3     72     35    -28    172    155
      9     94    774     52    674    874    241
     10     29    734     60    634    834    228
     11     79    509     60    409    609    161
     12     32    869     52    769    969    158
     13     66    506     48    406    606     67
     14     56    948     48    848   1048    165
     15     21    963     40    863   1063     99
     16      3    516     53    416    616    246
     17     29    506     58    406    606    166
     18     24    909     44    809   1009     55
     19     42    450     48    350    550    199
     20     32    298     38    198    398    246
      0     89    203     14     21    203    152    199     26     33     90      4     90     20     24     88     90     12    104    142
     89      0    115     77     68    115     63    110     68     55     19     88     16    109    112      0      7     98     19     54
    203    115      0    190    183      4     53     14    179    169    113    203    112    223    227    116    113    213     98     61
     14     77    190      0     15    190    140    186     11     23     76     17     77     33     39     77     78     26     91    129
     21     68    183     15      0    183    131    179     18     13     71     20     71     40     43     68     70     30     84    122
    203    115      4    190    183      0     53     11    180    170    114    204    113    223    227    116    113    214     99     61
    152     63     53    140    131     53      0     47    130    118     64    152     63    172    175     63     61    162     48     12
    199    110     14    186    179     11     47      0    176    165    110    199    109    219    222    111    108    209     95     56
     26     68    179     11     18    180    130    176      0     19     66     28     67     44     50     68     68     38     82    120
     33     55    169     23     13    170    118    165     19      0     57     33     57     53     57     54     57     43     71    109
     90     19    113     76     71    114     64    110     66     57      0     90      3    109    114     19     12    100     17     54
      4     88    203     17     20    204    152    199     28     33     90      0     91     20     23     88     90     10    104    142
     90     16    112     77     71    113     63    109     67     57      3     91      0    110    114     15      9    101     15     52
     20    109    223     33     40    223    172    219     44     53    109     20    110      0      9    108    110     12    124    162
     24    112    227     39     43    227    175    222     50     57    114     23    114      9      0    111    114     13    128    166
     88      0    116     77     68    116     63    111     68     54     19     88     15    108    111      0      6     98     19     54
     90      7    113     78     70    113     61    108     68     57     12     90      9    110    114      6      0    100     14     52
     12     98    213     26     30    214    162    209     38     43    100     10    101     12     13     98    100      0    114    152
    104     19     98     91     84     99     48     95     82     71     17    104     15    124    128     19     14    114      0     38
    142     54     61    129    122     61     12     56    120    109     54    142     52    162    166     54     52    152     38      0