# bench EOLE photo, generated by bep version 0.1, generation model "A"
bEpInstance_A_45_24
     45     24    100   1000     30     60     50    250    100    4.0
      1      8    899     37    799    999    183
      2     90    281     50    181    381     61
      3     81    509     36    409    609    222
      4     10    713     38    613    813    150
      5     83    305     33    205    405    118
      6     19    758     39    658    858    120
      7     46    946     60    846   1046     76
      8     65    455     52    355    555    198
      9     35    959     42    859   1059    100
     10     24     52     39    -48    152     59
     11     56    514     58    414    614    183
     12     22    175     35     75    275     60
     13     48    265     42    165    365    184
     14      2    712     30    612    812    146
     15     66    995     48    895   1095    112
     16     45    323     31    223    423    211
     17     28    458     31    358    558    154
     18     51    369     47    269    469     64
     19     89    479     52    379    579     72
     20     66    904     35    804   1004     76
     21     17    555     54    455    655     88
     22     26    829     50    729    929    235
     23     83    288     37    188    388    105
     24     61    286     32    186    386    229
     25     75    135     42     35    235    101
     26     50    985     40    885   1085    128
     27     46     64     45    -36    164     73
     28     97    661     37    561    761     77
     29     21     54     40    -46    154    146
     30     89      6     42    -94    106    192
     31     29    643     60    543    743    231
     32     93     59     54    -41    159    185
     33     19    212     58    112    312    190
     34     19    253     32    153    353    182
     35     32    587     54    487    687    107
     36     24     27     43    -73    127    142
     37      8    755     59    655    855    244
     38     76    351     50    251    451     61
     39    100    655     59    555    755    235
     40     72    759     48    659    859    232
     41     98    523     48    423    623     83
     42     78    696     55    596    796     68
     43     28    606     41    506    706    156
     44     63    805     60    705    905    193
     45     56    938     51    838   1038    114
      0    155     99     46    149     35     15    111     16    211     96    181    158     46     28    144    110    132    106     14     86     18    153    153    191     23    208     63    211    224     64    211    171    161     78    218     36    138     65     38     96     53     73     27     15
    155      0     57    109      6    120    166     43    170     59     58     31     11    109    178     15     46     24     49    155     70    137      2      7     36    176     55     95     59     68     91     55     24     19     77     65    120     17     93    119     60    103     82    131    164
     99     57      0     54     51     64    109     14    113    115      6     84     61     54    121     47     18     35      7     98     19     81     55     55     93    119    111     38    114    125     35    112     75     65     23    121     64     39     36     62      5     46     27     74    107
     46    109     54      0    103     11     58     65     61    165     51    134    112      2     71     97     63     86     61     49     39     29    107    107    145     68    162     25    164    177     18    164    125    115     31    171     10     91     26     19     52     17     27     26     57
    149      6     51    103      0    114    160     37    163     64     52     35     13    103    172     10     40     17     43    149     64    131      4      7     42    170     60     89     64     74     85     61     28     20     71     71    114     11     87    113     54     97     76    125    158
     35    120     64     11    114      0     47     76     50    176     61    145    123     12     60    108     75     97     71     38     50     17    118    118    156     57    173     31    176    188     28    175    136    126     42    182      2    102     32     13     61     21     38     16     45
     15    166    109     58    160     47      0    122      4    223    108    192    170     59     13    155    122    144    117     11     98     29    164    165    202      9    220     72    223    235     75    222    183    173     89    229     48    148     73     47    106     63     85     35      3
    111     43     14     65     37     76    122      0    126    101     14     70     47     66    135     33      9     21      8    112     27     94     41     42     80    132     97     52    100    112     47     99     61     51     34    107     76     26     50     76     18     60     38     87    120
     16    170    113     61    163     50      4    126      0    226    111    196    173     62     11    159    125    147    120     15    101     32    168    168    206      7    223     76    226    238     79    225    186    176     93    233     51    152     77     50    110     66     88     39      7
    211     59    115    165     64    176    223    101    226      0    115     30     53    165    235     67    101     79    107    213    125    194     60     59     24    233      6    153      0     19    147     17     40     50    133      6    175     75    151    177    119    161    138    188    221
     96     58      6     51     52     61    108     14    111    115      0     85     62     51    120     47     15     36     12     97     14     79     56     57     94    117    112     38    115    127     32    114     76     65     19    122     61     41     36     61     10     45     24     72    106
    181     31     84    134     35    145    192     70    196     30     85      0     23    134    205     37     70     49     77    182     95    163     32     29     16    202     28    122     30     45    117     34      9     19    103     37    145     46    121    146     89    131    107    157    190
    158     11     61    112     13    123    170     47    173     53     62     23      0    112    182     14     48     26     54    159     72    141     10      6     33    180     50     99     53     65     94     52     15      7     80     59    122     22     98    123     65    108     85    135    168
     46    109     54      2    103     12     59     66     62    165     51    134    112      0     72     97     63     86     62     50     39     29    107    107    145     69    162     26    164    177     18    164    125    114     32    171     10     92     28     21     52     19     27     27     58
     28    178    121     71    172     60     13    135     11    235    120    205    182     72      0    168    134    156    129     22    110     42    176    177    215      4    232     83    235    247     88    234    196    185    102    242     61    161     85     59    118     74     97     47     14
    144     15     47     97     10    108    155     33    159     67     47     37     14     97    168      0     34     11     40    145     58    126     12     10     47    165     64     85     67     80     80     67     28     18     66     74    108     10     84    109     51     93     70    120    153
    110     46     18     63     40     75    122      9    125    101     15     70     48     63    134     34      0     22     16    111     24     92     44     43     81    131     98     53    101    114     46    101     61     51     32    107     74     29     52     76     23     60     37     87    120
    132     24     35     86     17     97    144     21    147     79     36     49     26     86    156     11     22      0     29    133     47    115     21     20     58    154     76     73     79     91     68     78     40     30     54     85     97      7     72     97     40     82     59    109    142
    106     49      7     61     43     71    117      8    120    107     12     77     54     62    129     40     16     29      0    106     26     88     47     48     86    126    104     45    107    118     43    105     69     59     30    114     71     32     44     70     11     54     35     81    115
     14    155     98     49    149     38     11    112     15    213     97    182    159     50     22    145    111    133    106      0     88     21    154    154    192     20    210     61    212    224     65    211    173    163     79    219     39    138     62     36     95     52     75     24      8
     86     70     19     39     64     50     98     27    101    125     14     95     72     39    110     58     24     47     26     88      0     68     68     68    105    107    122     33    125    138     22    125     85     75      8    132     50     53     32     52     21     38     13     63     96
     18    137     81     29    131     17     29     94     32    194     79    163    141     29     42    126     92    115     88     21     68      0    135    136    173     39    191     45    193    206     46    193    154    144     60    200     19    120     47     20     78     35     55     11     28
    153      2     55    107      4    118    164     41    168     60     56     32     10    107    176     12     44     21     47    154     68    135      0      5     38    174     56     93     60     70     89     57     24     18     75     66    118     15     91    117     58    102     80    129    162
    153      7     55    107      7    118    165     42    168     59     57     29      6    107    177     10     43     20     48    154     68    136      5      0     37    174     55     94     58     70     89     57     21     13     75     65    117     16     92    118     59    102     80    129    163
    191     36     93    145     42    156    202     80    206     24     94     16     33    145    215     47     81     58     86    192    105    173     38     37      0    212     19    131     24     32    127     19     23     32    113     29    155     54    130    156     97    140    118    167    200
     23    176    119     68    170     57      9    132      7    233    117    202    180     69      4    165    131    154    126     20    107     39    174    174    212      0    230     81    232    244     85    231    193    183     99    239     58    158     83     56    116     72     94     45     11
    208     55    111    162     60    173    220     97    223      6    112     28     50    162    232     64     98     76    104    210    122    191     56     55     19    230      0    149      6     18    144     11     37     47    130     10    173     72    148    173    115    158    135    185    218
     63     95     38     25     89     31     72     52     76    153     38    122     99     26     83     85     53     73     45     61     33     45     93     94    131     81    149      0    152    163     17    150    113    103     24    159     32     77      1     25     34      9     22     36     70
    211     59    114    164     64    176    223    100    226      0    115     30     53    164    235     67    101     79    107    212    125    193     60     58     24    232      6    152      0     20    147     18     39     49    133      6    175     75    151    176    118    161    138    188    221
    224     68    125    177     74    188    235    112    238     19    127     45     65    177    247     80    114     91    118    224    138    206     70     70     32    244     18    163     20      0    159     13     54     64    145     17    188     86    162    188    129    172    150    199    233
     64     91     35     18     85     28     75     47     79    147     32    117     94     18     88     80     46     68     43     65     22     46     89     89    127     85    144     17    147    159      0    146    107     97     14    154     28     73     18     30     34     18      9     41     74
    211     55    112    164     61    175    222     99    225     17    114     34     52    164    234     67    101     78    105    211    125    193     57     57     19    231     11    150     18     13    146      0     42     51    132     19    175     73    149    175    116    159    137    186    219
    171     24     75    125     28    136    183     61    186     40     76      9     15    125    196     28     61     40     69    173     85    154     24     21     23    193     37    113     39     54    107     42      0     10     93     46    135     37    112    137     80    121     98    148    181
    161     19     65    115     20    126    173     51    176     50     65     19      7    114    185     18     51     30     59    163     75    144     18     13     32    183     47    103     49     64     97     51     10      0     83     56    125     28    102    127     70    111     88    138    171
     78     77     23     31     71     42     89     34     93    133     19    103     80     32    102     66     32     54     30     79      8     60     75     75    113     99    130     24    133    145     14    132     93     83      0    140     42     60     24     44     22     29      4     55     87
    218     65    121    171     71    182    229    107    233      6    122     37     59    171    242     74    107     85    114    219    132    200     66     65     29    239     10    159      6     17    154     19     46     56    140      0    182     82    158    183    125    167    144    194    227
     36    120     64     10    114      2     48     76     51    175     61    145    122     10     61    108     74     97     71     39     50     19    118    117    155     58    173     32    175    188     28    175    135    125     42    182      0    102     33     16     62     22     37     18     47
    138     17     39     91     11    102    148     26    152     75     41     46     22     92    161     10     29      7     32    138     53    120     15     16     54    158     72     77     75     86     73     73     37     28     60     82    102      0     76    102     43     86     64    113    146
     65     93     36     26     87     32     73     50     77    151     36    121     98     28     85     84     52     72     44     62     32     47     91     92    130     83    148      1    151    162     18    149    112    102     24    158     33     76      0     26     33     11     21     38     71
     38    119     62     19    113     13     47     76     50    177     61    146    123     21     59    109     76     97     70     36     52     20    117    118    156     56    173     25    176    188     30    175    137    127     44    183     16    102     26      0     59     15     39     11     44
     96     60      5     52     54     61    106     18    110    119     10     89     65     52    118     51     23     40     11     95     21     78     58     59     97    116    115     34    118    129     34    116     80     70     22    125     62     43     33     59      0     43     27     71    104
     53    103     46     17     97     21     63     60     66    161     45    131    108     19     74     93     60     82     54     52     38     35    102    102    140     72    158      9    161    172     18    159    121    111     29    167     22     86     11     15     43      0     25     27     60
     73     82     27     27     76     38     85     38     88    138     24    107     85     27     97     70     37     59     35     75     13     55     80     80    118     94    135     22    138    150      9    137     98     88      4    144     37     64     21     39     27     25      0     50     83
     27    131     74     26    125     16     35     87     39    188     72    157    135     27     47    120     87    109     81     24     63     11    129    129    167     45    185     36    188    199     41    186    148    138     55    194     18    113     38     11     71     27     50      0     33
     15    164    107     57    158     45      3    120      7    221    106    190    168     58     14    153    120    142    115      8     96     28    162    163    200     11    218     70    221    233     74    219    181    171     87    227     47    146     71     44    104     60     83     33      0