# bench EOLE photo, generated by bep version 0.1, generation model "A"
bEpInstance_A_20_12
     20     12    100   1000     30     60     50    250    100    4.0
      1     79    440     33    340    540    215
      2     69    130     39     30    230    153
      3     64    491     32    391    591    133
      4     28     87     41    -13    187    146
      5     64    130     54     30    230    229
      6     82    602     41    502    702    229
      7     19    185     59     85    285    206
      8      3    682     55    582    782    214
      9     12    925     49    825   1025    212
     10      5    953     40    853   1053    189
     11     44    412     33    312    512    196
     12     50    476     36    376    576     77
     13     61    987     31    887   1087    135
     14     59    412     39    312    512    207
     15     60    266     47    166    366    176
     16     95    372     43    272    472     64
     17     29     88     57    -12    188    120
     18      4    207     31    107    307    147
     19     62    158     36     58    258     73
     20     63    423     37    323    523     98
      0     77     13     89     77     40     65     63    122    129     11     11    136      8     43     17     88     61     70      5
     77      0     90     14      1    118     18    138    199    206     70     86    214     70     34     60     14     25      7     73
     13     90      0    101     90     28     77     50    109    116     20      5    124     19     56     30    101     72     83     17
     89     14    101      0     14    129     24    148    209    216     81     97    225     81     45     73      0     30     19     84
     77      1     90     14      0    118     17    138    199    206     70     86    214     70     34     60     13     24      7     73
     40    118     28    129    118      0    105     28     82     89     48     32     96     47     84     57    129    100    111     45
     65     18     77     24     17    105      0    124    185    192     57     73    200     57     22     50     24      6     12     60
     63    138     50    148    138     28    124      0     60     67     68     52     77     68    104     80    148    118    131     66
    122    199    109    209    199     82    185     60      0      7    128    112     19    128    165    139    209    179    192    126
    129    206    116    216    206     89    192     67      7      0    135    119     16    135    172    146    216    186    199    133
     11     70     20     81     70     48     57     68    128    135      0     16    143      3     36     16     81     52     63      5
     11     86      5     97     86     32     73     52    112    119     16      0    127     16     52     28     97     68     79     13
    136    214    124    225    214     96    200     77     19     16    143    127      0    143    180    153    224    195    207    141
      8     70     19     81     70     47     57     68    128    135      3     16    143      0     36     13     81     53     63      2
     43     34     56     45     34     84     22    104    165    172     36     52    180     36      0     27     45     20     27     39
     17     60     30     73     60     57     50     80    139    146     16     28    153     13     27      0     72     47     54     15
     88     14    101      0     13    129     24    148    209    216     81     97    224     81     45     72      0     30     19     84
     61     25     72     30     24    100      6    118    179    186     52     68    195     53     20     47     30      0     18     55
     70      7     83     19      7    111     12    131    192    199     63     79    207     63     27     54     19     18      0     66
      5     73     17     84     73     45     60     66    126    133      5     13    141      2     39     15     84     55     66      0