# bench EOLE photo, generated by bep version 0.1, generation model "A"
bEpInstance_A_20_76
     20     76    100   1000     30     60     50    250    100    4.0
      1     22    374     44    274    474    212
      2     46    757     42    657    857    129
      3     18    904     35    804   1004    103
      4     46    898     39    798    998    128
      5     76    534     34    434    634    100
      6     44     64     56    -36    164     77
      7     38    357     41    257    457    206
      8     95    752     52    652    852     83
      9     12    201     60    101    301    168
     10     96    386     60    286    486     79
     11     29    172     42     72    272    201
     12      7    732     34    632    832    216
     13     26    275     32    175    375    191
     14     34    931     56    831   1031    195
     15     29    198     45     98    298     97
     16     95    224     42    124    324     65
     17     43    378     50    278    478    127
     18     77    652     46    552    752     60
     19     83    941     54    841   1041    229
     20     67    946     52    846   1046    238
      0     95    132    131     42     77      5     96     43     18     50     89     24    139     44     41      5     70    142    143
     95      0     37     35     56    173    100     12    139     93    146     11    120     43    139    133     94     27     46     47
    132     37      0      7     93    210    136     42    175    130    183     43    157      7    176    171    131     64     18     16
    131     35      7      0     91    208    135     38    174    128    181     42    155      8    175    168    130     61     14     13
     42     56     93     91      0    117     45     54     84     37     91     52     65     99     84     77     39     29    101    103
     77    173    210    208    117      0     73    172     35     81     27    167     52    216     33     41     78    147    219    220
      5    100    136    135     45     73      0     99     39     16     46     94     20    143     39     36      5     74    146    147
     96     12     42     38     54    172     99      0    139     91    145     22    120     47    139    132     94     25     47     49
     43    139    175    174     84     35     39    139      0     50      8    132     18    182      4     21     44    113    185    186
     18     93    130    128     37     81     16     91     50      0     56     89     32    137     49     40     13     66    138    140
     50    146    183    181     91     27     46    145      8     56      0    140     25    189      6     21     51    120    192    193
     89     11     43     42     52    167     94     22    132     89    140      0    114     50    133    128     88     26     55     55
     24    120    157    155     65     52     20    120     18     32     25    114      0    164     19     21     26     95    167    168
    139     43      7      8     99    216    143     47    182    137    189     50    164      0    183    177    138     70     12      9
     44    139    176    175     84     33     39    139      4     49      6    133     19    183      0     17     45    114    186    187
     41    133    171    168     77     41     36    132     21     40     21    128     21    177     17      0     40    107    179    180
      5     94    131    130     39     78      5     94     44     13     51     88     26    138     45     40      0     69    141    142
     70     27     64     61     29    147     74     25    113     66    120     26     95     70    114    107     69      0     72     73
    142     46     18     14    101    219    146     47    185    138    192     55    167     12    186    179    141     72      0      4
    143     47     16     13    103    220    147     49    186    140    193     55    168      9    187    180    142     73      4      0