# bench EOLE photo, generated by bep version 0.1, generation model "A"
bEpInstance_A_10_52
     10     52    100   1000     30     60     50    250    100    4.0
      1     62    457     36    357    557     74
      2      4    954     53    854   1054    112
      3     85    870     44    770    970    226
      4     83    647     30    547    747    121
      5     39    183     60     83    283    121
      6     69    756     44    656    856     93
      7     87    339     55    239    439     65
      8     21    701     43    601    801    216
      9     15    637     59    537    737     90
     10     59    694     45    594    794    138
      0    125    103     47     68     74     30     61     46     59
    125      0     29     79    192     52    155     63     79     66
    103     29      0     55    172     28    132     45     60     44
     47     79     55      0    116     27     77     20     17     13
     68    192    172    116      0    143     40    129    113    127
     74     52     28     27    143      0    104     18     32     15
     30    155    132     77     40    104      0     91     76     89
     61     63     45     20    129     18     91      0     16      9
     46     79     60     17    113     32     76     16      0     18
     59     66     44     13    127     15     89      9     18      0