# bench EOLE photo, generated by bep version 0.1, generation model "A"
bEpInstance_A_25_8
     25      8    100   1000     30     60     50    250    100    4.0
      1     35    790     58    690    890     58
      2     96    248     56    148    348    218
      3     93    654     47    554    754    104
      4     68    383     57    283    483    179
      5     92    577     30    477    677    201
      6     53    887     47    787    987    234
      7     28    273     49    173    373    250
      8     16    935     56    835   1035    154
      9     73    755     47    655    855    186
     10      0    431     46    331    531    236
     11      8     67     36    -33    167    204
     12     45     96     42     -4    196    123
     13     68    416     33    316    516     91
     14     30    689     33    589    789    167
     15     97    739     48    639    839     75
     16     67    431     50    331    531    129
     17     18    212     32    112    312     88
     18     64    593     33    493    693    196
     19     66    309     45    209    409     72
     20     40    906     44    806   1006     65
     21     32    597     38    497    697    175
     22     28    411     36    311    511     99
     23     15    790     41    690    890    215
     24     22     26     36    -74    126    131
     25     24    296     48    196    396    227
      0    136     36    102     55     24    129     36     12     90    180    173     93     25     20     90    144     49    120     29     48     94      5    191    123
    136      0    101     34     82    160     18    172    126     51     50     40     42    111    122     46     21     86     16    165     88     44    137     58     21
     36    101      0     68     19     59     96     72     25     60    148    140     59     18     21     56    112     16     86     64     20     62     39    158     91
    102     34     68      0     48    126     29    138     93     20     80     71      8     77     89     12     44     52     18    130     54     12    102     89     24
     55     82     19     48      0     78     77     91     44     43    129    120     40     32     40     37     93      8     67     83     15     44     56    138     72
     24    160     59    126     78      0    153     15     33    114    205    197    117     49     38    114    168     73    144      5     72    119     26    215    147
    129     18     96     29     77    153      0    165    121     40     51     44     37    104    117     40     15     80     13    158     81     34    129     61      5
     36    172     72    138     91     15    165      0     47    126    217    209    130     61     53    126    180     86    156      9     84    131     36    227    159
     12    126     25     93     44     33    121     47      0     83    172    164     84     19      7     81    136     40    111     38     40     86     16    182    115
     90     51     60     20     43    114     40    126     83      0     91     84     17     64     80     16     54     43     34    119     42      8     89    101     34
    180     50    148     80    129    205     51    217    172     91      0     11     88    155    169     92     36    132     62    209    132     86    180     10     57
    173     40    140     71    120    197     44    209    164     84     11      0     80    148    161     83     29    124     53    202    125     78    173     18     50
     93     42     59      8     40    117     37    130     84     17     88     80      0     68     81      3     52     44     26    122     46     10     94     98     31
     25    111     18     77     32     49    104     61     19     64    155    148     68      0     20     65    119     25     95     54     23     69     25    165     98
     20    122     21     89     40     38    117     53      7     80    169    161     81     20      0     77    133     37    107     44     39     83     24    179    112
     90     46     56     12     37    114     40    126     81     16     92     83      3     65     77      0     56     40     30    118     42     10     90    101     35
    144     21    112     44     93    168     15    180    136     54     36     29     52    119    133     56      0     95     27    173     96     49    144     46     21
     49     86     16     52      8     73     80     86     40     43    132    124     44     25     37     40     95      0     71     78      8     46     50    142     74
    120     16     86     18     67    144     13    156    111     34     62     53     26     95    107     30     27     71      0    149     72     27    120     71     10
     29    165     64    130     83      5    158      9     38    119    209    202    122     54     44    118    173     78    149      0     77    123     29    220    152
     48     88     20     54     15     72     81     84     40     42    132    125     46     23     39     42     96      8     72     77      0     46     48    142     75
     94     44     62     12     44    119     34    131     86      8     86     78     10     69     83     10     49     46     27    123     46      0     94     96     28
      5    137     39    102     56     26    129     36     16     89    180    173     94     25     24     90    144     50    120     29     48     94      0    191    123
    191     58    158     89    138    215     61    227    182    101     10     18     98    165    179    101     46    142     71    220    142     96    191      0     67
    123     21     91     24     72    147      5    159    115     34     57     50     31     98    112     35     21     74     10    152     75     28    123     67      0