# bench EOLE photo, generated by bep version 0.1, generation model "A"
bEpInstance_A_20_91
     20     91    100   1000     30     60     50    250    100    4.0
      1     59    566     30    466    666    171
      2     47    562     55    462    662    113
      3     76    666     39    566    766    188
      4     47    165     35     65    265    204
      5     98    987     30    887   1087    183
      6      1    613     41    513    713    187
      7     81    529     45    429    629     88
      8     31    937     43    837   1037    231
      9     50    450     45    350    550    245
     10      1    327     38    227    427    205
     11    100    608     44    508    708    143
     12     78    645     37    545    745    199
     13     63    256     42    156    356    179
     14     87    791     40    691    891    186
     15     32    813     56    713    913    177
     16     75    304     46    204    404    100
     17     76     48     36    -52    148    204
     18     37    510     46    410    610    124
     19     11      3     55    -97    103    229
     20     65     69     49    -31    169    106
      0      3     25    100    105     18     10     93     29     61     14     20     77     56     62     65    129     15    141    124
      3      0     26     99    107     17     11     93     28     59     17     22     76     58     62     64    128     13    140    123
     25     26      0    125     80     22     34     68     54     86     15      5    102     31     38     90    154     40    166    149
    100     99    125      0    205    112     91    193     71     42    111    120     23    156    162     35     30     86     41     24
    105    107     80    205      0     96    114     20    134    166     94     85    182     49     46    170    234    120    246    229
     18     17     22    112     96      0     29     81     42     71     24     20     90     49     50     79    142     27    152    136
     10     11     34     91    114     29      0    102     21     54     20     29     68     65     72     56    120     11    132    115
     93     93     68    193     20     81    102      0    121    152     84     73    170     39     31    158    222    106    233    217
     29     28     54     71    134     42     21    121      0     33     41     49     48     85     90     37    100     15    112     95
     61     59     86     42    166     71     54    152     33      0     74     81     23    117    121     19     72     46     81     66
     14     17     15    111     94     24     20     84     41     74      0     10     88     45     53     76    140     29    152    135
     20     22      5    120     85     20     29     73     49     81     10      0     97     36     43     85    149     35    161    144
     77     76    102     23    182     90     68    170     48     23     88     97      0    133    139     12     52     63     64     46
     56     58     31    156     49     49     65     39     85    117     45     36    133      0     14    121    185     71    197    180
     62     62     38    162     46     50     72     31     90    121     53     43    139     14      0    127    191     75    202    186
     65     64     90     35    170     79     56    158     37     19     76     85     12    121    127      0     64     52     76     58
    129    128    154     30    234    142    120    222    100     72    140    149     52    185    191     64      0    115     19      5
     15     13     40     86    120     27     11    106     15     46     29     35     63     71     75     52    115      0    126    110
    141    140    166     41    246    152    132    233    112     81    152    161     64    197    202     76     19    126      0     21
    124    123    149     24    229    136    115    217     95     66    135    144     46    180    186     58      5    110     21      0