# bench EOLE photo, generated by bep version 0.1, generation model "A"
bEpInstance_A_45_84
     45     84    100   1000     30     60     50    250    100    4.0
      1      8    178     42     78    278    224
      2     43    526     39    426    626    201
      3     13     82     53    -18    182    163
      4     17    310     53    210    410    164
      5     71    152     51     52    252     58
      6     52    504     44    404    604    172
      7     22    689     46    589    789    221
      8     18    267     50    167    367    104
      9     45     64     34    -36    164    227
     10     59    440     49    340    540    195
     11     52    397     38    297    497    189
     12     71     46     38    -54    146    133
     13     20    949     44    849   1049    195
     14     45    933     40    833   1033    186
     15     62    872     46    772    972    212
     16     14    192     32     92    292    167
     17     25    220     44    120    320    220
     18     66    102     47      2    202     86
     19     50    860     57    760    960     91
     20     91    141     49     41    241     71
     21      9     80     55    -20    180    158
     22      1    156     36     56    256    177
     23      2    751     43    651    851     83
     24     95    523     53    423    623     90
     25     74    219     31    119    319    130
     26     32    616     48    516    716    214
     27     48    462     30    362    562    126
     28     60    650     45    550    750    189
     29     73    313     37    213    413    199
     30     47    456     41    356    556    150
     31     20    820     50    720    920     80
     32     34    417     40    317    517     66
     33     64    395     45    295    495    242
     34      1     70     54    -30    170    147
     35     53    804     56    704    904     77
     36     45    354     55    254    454     86
     37     67     64     58    -36    164     77
     38     52    302     49    202    402    196
     39     12    300     57    200    400    143
     40     72    226     46    126    326    120
     41     62     34     39    -66    134    177
     42     10     86     33    -14    186    178
     43     89    986     53    886   1086    118
     44     34    601     46    501    701     51
     45     67    450     34    350    550     87
      0     87     24     33     17     82    127     22     29     66     55     36    192    188    174      3     11     23    170     22     24      5    143     88     19    109     71    118     37     70    160     60     56     27    156     44     32     32     30     20     38     23    203    105     69
     87      0    111     54     93      5     41     65    115     21     32    120    105    101     86     83     76    106     83     96    111     93     57     13     77     22     16     31     53     17     73     27     33    114     69     43    115     56     57     75    123    110    115     18     19
     24    111      0     57     22    105    151     46      9     90     79     17    216    212    197     27     34     14    194     24      1     18    167    112     37    133     95    142     59     93    184     83     79      4    180     68     14     55     54     38     17      1    226    129     92
     33     54     57      0     41     49     94     10     61     34     23     67    159    155    140     29     22     53    137     46     57     38    110     56     26     76     38     85     14     37    127     27     24     60    123     13     62      8      2     25     69     56    169     72     37
     17     93     22     41      0     88    134     31     22     72     61     26    199    195    180     17     20     12    177      5     23     17    150     92     16    116     77    124     40     76    167     66     60     26    163     50     22     37     39     18     29     22    208    112     74
     82      5    105     49     88      0     46     59    110     16     26    114    111    107     92     78     71    100     89     91    106     87     63     11     71     28     10     36     48     12     79     22     27    109     75     37    110     50     51     69    117    105    120     24     14
    127     41    151     94    134     46      0    105    156     62     73    161     65     61     46    124    117    147     43    138    152    133     16     45    118     18     57     13     94     58     32     68     74    154     29     83    156     97     97    116    164    150     76     22     60
     22     65     46     10     31     59    105      0     51     44     33     56    170    166    151     18     11     42    148     36     46     28    121     66     18     87     49     96     17     47    138     37     34     49    134     22     52     12      8     16     59     45    180     83     47
     29    115      9     61     22    110    156     51      0     94     83      7    221    217    202     32     39     10    199     22      9     25    172    115     39    138     99    146     62     98    189     88     82     11    185     72      5     59     59     41      8     10    230    134     96
     66     21     90     34     72     16     62     44     94      0     10     98    127    123    108     63     55     84    105     75     90     72     79     22     55     44      6     52     31      5     95      8     11     93     91     21     94     34     36     53    101     89    136     40      3
     55     32     79     23     61     26     73     33     83     10      0     87    138    134    118     52     44     73    115     64     79     61     89     33     44     54     16     63     21     14    106      6      3     82    101     10     83     23     26     43     90     78    147     51     13
     36    120     17     67     26    114    161     56      7     98     87      0    226    221    206     39     44     14    203     24     17     32    177    119     43    142    104    151     66    102    193     93     87     18    189     77      4     64     65     45      3     18    235    139    101
    192    105    216    159    199    111     65    170    221    127    138    226      0      7     21    189    182    212     23    202    217    198     49    108    182     83    121     75    159    123     32    133    138    219     37    148    221    161    162    181    228    215     19     87    125
    188    101    212    155    195    107     61    166    217    123    134    221      7      0     15    185    178    207     18    198    213    194     46    103    178     79    117     70    155    119     28    129    134    216     32    144    217    157    158    176    224    211     17     83    120
    174     86    197    140    180     92     46    151    202    108    118    206     21     15      0    170    163    192      4    182    198    179     33     87    163     64    102     55    139    104     16    113    119    201     17    129    202    142    143    161    209    196     29     68    105
      3     83     27     29     17     78    124     18     32     63     52     39    189    185    170      0      7     25    167     23     28      9    139     85     16    106     68    115     33     66    157     56     52     30    153     41     34     29     27     16     41     26    199    102     65
     11     76     34     22     20     71    117     11     39     55     44     44    182    178    163      7      0     31    160     25     35     17    132     77     12     99     60    107     26     59    150     49     44     37    146     33     40     21     20     11     47     33    192     95     58
     23    106     14     53     12    100    147     42     10     84     73     14    212    207    192     25     31      0    189     11     15     21    163    105     29    128     90    137     52     88    179     79     73     18    175     63      9     50     51     31     17     14    221    125     87
    170     83    194    137    177     89     43    148    199    105    115    203     23     18      4    167    160    189      0    180    195    176     29     84    160     61     99     52    136    101     12    110    116    197     14    126    199    139    140    158    206    193     32     64    102
     22     96     24     46      5     91    138     36     22     75     64     24    202    198    182     23     25     11    180      0     25     22    154     95     19    119     80    127     43     79    170     70     63     28    166     54     20     41     44     21     27     24    211    115     77
     24    111      1     57     23    106    152     46      9     90     79     17    217    213    198     28     35     15    195     25      0     19    167    112     38    134     95    143     60     94    185     84     79      3    181     69     15     56     55     39     17      1    227    130     93
      5     93     18     38     17     87    133     28     25     72     61     32    198    194    179      9     17     21    176     22     19      0    148     94     24    115     77    124     43     75    166     65     61     21    162     50     28     38     36     24     34     17    208    111     75
    143     57    167    110    150     63     16    121    172     79     89    177     49     46     33    139    132    163     29    154    167    148      0     61    134     34     73     29    110     74     17     83     90    170     18     99    172    112    112    132    179    166     62     38     76
     88     13    112     56     92     11     45     66    115     22     33    119    108    103     87     85     77    105     84     95    112     94     61      0     76     28     19     32     52     20     76     30     32    115     71     44    114     56     59     74    122    111    115     24     19
     19     77     37     26     16     71    118     18     39     55     44     43    182    178    163     16     12     29    160     19     38     24    134     76      0     99     61    107     23     59    150     50     44     41    146     34     38     21     25      1     46     36    191     96     57
    109     22    133     76    116     28     18     87    138     44     54    142     83     79     64    106     99    128     61    119    134    115     34     28     99      0     38     11     76     40     51     49     55    136     47     65    138     78     79     98    145    132     93      3     42
     71     16     95     38     77     10     57     49     99      6     16    104    121    117    102     68     60     90     99     80     95     77     73     19     61     38      0     47     37      1     89     11     17     98     85     27     99     40     41     59    107     94    131     34      5
    118     31    142     85    124     36     13     96    146     52     63    151     75     70     55    115    107    137     52    127    143    124     29     32    107     11     47      0     84     48     43     58     63    145     38     74    146     87     88    106    154    141     84     13     50
     37     53     59     14     40     48     94     17     62     31     21     66    159    155    139     33     26     52    136     43     60     43    110     52     23     76     37     84      0     36    127     27     20     63    122     12     62      5     15     21     69     58    168     72     34
     70     17     93     37     76     12     58     47     98      5     14    102    123    119    104     66     59     88    101     79     94     75     74     20     59     40      1     48     36      0     91     10     15     97     87     25     98     38     39     57    105     92    132     36      5
    160     73    184    127    167     79     32    138    189     95    106    193     32     28     16    157    150    179     12    170    185    166     17     76    150     51     89     43    127     91      0    100    106    187      9    116    189    129    130    149    196    183     44     54     93
     60     27     83     27     66     22     68     37     88      8      6     93    133    129    113     56     49     79    110     70     84     65     83     30     50     49     11     58     27     10    100      0      9     87     96     15     88     29     29     48     96     82    142     46     11
     56     33     79     24     60     27     74     34     82     11      3     87    138    134    119     52     44     73    116     63     79     61     90     32     44     55     17     63     20     15    106      9      0     82    102     11     82     23     27     42     90     78    147     52     13
     27    114      4     60     26    109    154     49     11     93     82     18    219    216    201     30     37     18    197     28      3     21    170    115     41    136     98    145     63     97    187     87     82      0    183     71     16     59     57     42     17      4    230    133     96
    156     69    180    123    163     75     29    134    185     91    101    189     37     32     17    153    146    175     14    166    181    162     18     71    146     47     85     38    122     87      9     96    102    183      0    112    185    125    126    144    192    179     46     50     88
     44     43     68     13     50     37     83     22     72     21     10     77    148    144    129     41     33     63    126     54     69     50     99     44     34     65     27     74     12     25    116     15     11     71    112      0     72     13     15     32     80     67    158     61     24
     32    115     14     62     22    110    156     52      5     94     83      4    221    217    202     34     40      9    199     20     15     28    172    114     38    138     99    146     62     98    189     88     82     16    185     72      0     59     60     40      7     15    230    134     96
     32     56     55      8     37     50     97     12     59     34     23     64    161    157    142     29     21     50    139     41     56     38    112     56     21     78     40     87      5     38    129     29     23     59    125     13     59      0     10     19     67     55    171     74     37
     30     57     54      2     39     51     97      8     59     36     26     65    162    158    143     27     20     51    140     44     55     36    112     59     25     79     41     88     15     39    130     29     27     57    126     15     60     10      0     23     67     53    172     75     39
     20     75     38     25     18     69    116     16     41     53     43     45    181    176    161     16     11     31    158     21     39     24    132     74      1     98     59    106     21     57    149     48     42     42    144     32     40     19     23      0     48     38    190     94     56
     38    123     17     69     29    117    164     59      8    101     90      3    228    224    209     41     47     17    206     27     17     34    179    122     46    145    107    154     69    105    196     96     90     17    192     80      7     67     67     48      0     18    238    141    104
     23    110      1     56     22    105    150     45     10     89     78     18    215    211    196     26     33     14    193     24      1     17    166    111     36    132     94    141     58     92    183     82     78      4    179     67     15     55     53     38     18      0    225    128     92
    203    115    226    169    208    120     76    180    230    136    147    235     19     17     29    199    192    221     32    211    227    208     62    115    191     93    131     84    168    132     44    142    147    230     46    158    230    171    172    190    238    225      0     97    134
    105     18    129     72    112     24     22     83    134     40     51    139     87     83     68    102     95    125     64    115    130    111     38     24     96      3     34     13     72     36     54     46     52    133     50     61    134     74     75     94    141    128     97      0     38
     69     19     92     37     74     14     60     47     96      3     13    101    125    120    105     65     58     87    102     77     93     75     76     19     57     42      5     50     34      5     93     11     13     96     88     24     96     37     39     56    104     92    134     38      0