# bench EOLE photo, generated by bep version 0.1, generation model "A"
bEpInstance_A_25_71
     25     71    100   1000     30     60     50    250    100    4.0
      1     42    307     59    207    407    191
      2     79    651     48    551    751    234
      3     66    978     49    878   1078    141
      4     45    134     56     34    234     67
      5     34    710     35    610    810    237
      6      7    538     40    438    638    205
      7     73    451     54    351    551    209
      8     98    676     49    576    776    130
      9     99    600     33    500    700    205
     10     25    707     51    607    807    232
     11     69    328     41    228    428     77
     12     46    224     36    124    324    212
     13     94    388     52    288    488     51
     14     93     71     54    -29    171    181
     15     52    588     43    488    688    150
     16     26     84     57    -16    184     99
     17     69      0     30   -100    100    237
     18     71    713     56    613    813    128
     19      4    208     46    108    308    151
     20     43    753     39    653    853    123
     21     14     49     41    -51    149     63
     22     12    160     52     60    260    179
     23     75    170     34     70    270     52
     24     25     38     38    -62    138    238
     25      3    281     57    181    381    200
      0     86    167     43    100     58     36     93     74    100      8     20     24     60     70     55     77    101     26    111     64     37     35     67     11
     86      0     81    129     18     33     50      7     13     19     80    107     65    145     17    142    162     15    112     27    151    123    120    153     94
    167     81      0    211     67    110    131     75     94     68    162    188    147    226     97    223    244     66    193     56    232    204    202    235    174
     43    129    211      0    144    101     79    136    117    143     48     22     64     19    113     13     34    144     21    154     22     10     11     24     38
    100     18     67    144      0     43     65     18     31      2     95    121     81    160     30    156    177      9    125     10    165    137    135    168    107
     58     33    110    101     43      0     27     41     27     42     54     79     43    118     16    113    135     46     82     54    122     94     93    125     64
     36     50    131     79     65     27      0     56     37     65     30     57     16     95     34     92    112     65     63     75    101     74     70    103     45
     93      7     75    136     18     41     56      0     19     19     87    113     72    151     24    149    169     11    119     23    158    130    126    160    101
     74     13     94    117     31     27     37     19      0     32     68     94     53    132     12    130    150     29    100     40    139    112    107    141     83
    100     19     68    143      2     42     65     19     32      0     95    120     81    159     30    155    177     11    124     12    164    136    134    167    106
      8     80    162     48     95     54     30     87     68     95      0     26     16     64     65     61     82     96     34    106     71     44     39     73     20
     20    107    188     22    121     79     57    113     94    120     26      0     42     40     91     35     56    122     11    132     44     18     15     46     17
     24     65    147     64     81     43     16     72     53     81     16     42      0     79     51     77     97     81     50     92     87     60     54     89     35
     60    145    226     19    160    118     95    151    132    159     64     40     79      0    129     17     18    160     40    170     20     30     25     18     57
     70     17     97    113     30     16     34     24     12     30     65     91     51    129      0    126    147     31     95     41    135    107    104    137     77
     55    142    223     13    156    113     92    149    130    155     61     35     77     17    126      0     23    157     31    167      9     19     24     11     49
     77    162    244     34    177    135    112    169    150    177     82     56     97     18    147     23      0    178     54    188     18     42     42     14     72
    101     15     66    144      9     46     65     11     29     11     96    122     81    160     31    157    178      0    127     12    166    139    135    169    109
     26    112    193     21    125     82     63    119    100    124     34     11     50     40     95     31     54    127      0    136     39     12     20     42     18
    111     27     56    154     10     54     75     23     40     12    106    132     92    170     41    167    188     12    136      0    176    148    145    178    118
     64    151    232     22    165    122    101    158    139    164     71     44     87     20    135      9     18    166     39    176      0     27     33      3     58
     37    123    204     10    137     94     74    130    112    136     44     18     60     30    107     19     42    139     12    148     27      0     15     30     30
     35    120    202     11    135     93     70    126    107    134     39     15     54     25    104     24     42    135     20    145     33     15      0     35     33
     67    153    235     24    168    125    103    160    141    167     73     46     89     18    137     11     14    169     42    178      3     30     35      0     60
     11     94    174     38    107     64     45    101     83    106     20     17     35     57     77     49     72    109     18    118     58     30     33     60      0