# bench EOLE photo, generated by bep version 0.1, generation model "A"
bEpInstance_A_40_95
     40     95    100   1000     30     60     50    250    100    4.0
      1     53    220     37    120    320    227
      2     20    950     38    850   1050    149
      3     99      8     56    -92    108    118
      4      8    875     34    775    975    173
      5     20    551     39    451    651    213
      6     31    340     51    240    440    186
      7     24    453     55    353    553    147
      8     19    205     58    105    305    194
      9     42    147     48     47    247    176
     10      9    872     33    772    972     67
     11     88    991     43    891   1091    243
     12     87    583     47    483    683     63
     13     13    880     57    780    980    139
     14     22    581     33    481    681    142
     15      3    959     59    859   1059     95
     16     16    866     59    766    966    168
     17      1    551     36    451    651     72
     18     42    348     36    248    448    110
     19     34    624     38    524    724     90
     20     20    843     38    743    943    118
     21     72    152     54     52    252    239
     22     74    908     42    808   1008    203
     23     87    346     60    246    446     56
     24     21    940     49    840   1040     95
     25     49    840     40    740    940    233
     26     19    533     36    433    633    155
     27     15    478     52    378    578    123
     28     32      0     51   -100    100     58
     29     15    489     60    389    589    227
     30     40    383     50    283    483    103
     31     73    645     39    545    745    239
     32     59    914     35    814   1014     64
     33     76    502     60    402    602    239
     34      3    201     44    101    301     88
     35     68    198     47     98    298    250
     36     20    260     31    160    360    120
     37     75     25     37    -75    125     79
     38     41    887     42    787    987     77
     39     53    705     32    605    805     73
     40     62    243     35    143    343    124
      0    182     54    164     83     30     58      9     18    163    192     91    165     90    185    161     83     32    101    155     17    172     32    180    155     78     65     55     67     40    106    173     70     13      6     12     49    166    121      6
    182      0    236     18     99    152    124    186    200     19     19     93     17     92      4     21     99    150     81     26    199     17    151      2     28    104    118    237    115    141     77     13    112    187    188    172    231     16     61    177
     54    236      0    217    137     84    112     53     37    217    245    143    219    144    238    215    137     86    154    209     36    225     84    233    208    132    119     16    122     94    159    226    123     53     48     66      7    220    174     59
    164     18    217      0     81    133    105    167    182      0     35     75      1     73     21      3     81    132     63      8    181     18    133     16     13     85     99    218     96    123     59     16     94    168    169    153    213      8     43    158
     83     99    137     81      0     52     24     86    101     80    111     18     82      7    102     78      4     51     18     73    100     90     53     97     72      4     18    137     15     42     26     91     18     87     89     72    132     84     39     77
     30    152     84    133     52      0     28     33     48    133    163     62    135     60    154    131     53      3     71    125     48    142     14    150    125     48     34     85     37     10     76    143     42     35     36     20     79    136     91     25
     58    124    112    105     24     28      0     62     76    104    135     36    106     32    126    103     25     26     42     97     76    114     31    121     96     20      6    113      9     17     49    115     17     63     64     48    107    108     63     53
      9    186     53    167     86     33     62      0     15    166    197     96    168     94    188    165     86     36    104    159     18    176     39    183    158     82     68     51     71     44    110    177     75      4     12     13     47    170    125     14
     18    200     37    182    101     48     76     15      0    181    211    109    183    108    203    179    101     50    119    174      7    190     51    198    173     96     83     36     85     59    124    191     89     16     14     28     31    185    139     24
    163     19    217      0     80    133    104    166    181      0     35     74      2     72     21      2     80    131     62      7    180     18    132     17     12     84     98    218     95    122     58     16     94    167    169    153    212      8     43    157
    192     19    245     35    111    163    135    197    211     35      0    102     33    103     22     36    112    161     92     40    209     21    161     21     38    115    129    248    126    152     86     20    122    198    198    183    241     28     72    187
     91     93    143     75     18     62     36     96    109     74    102      0     76     16     96     72     22     59     16     67    107     81     59     90     64     21     31    146     29     51     15     83     20     97     96     82    139     76     31     85
    165     17    219      1     82    135    106    168    183      2     33     76      0     74     19      3     82    133     64      9    182     16    134     15     13     86    100    220     97    124     60     14     95    169    171    155    214      7     44    159
     90     92    144     73      7     60     32     94    108     72    103     16     74      0     94     71      9     58     11     65    107     82     60     89     65     12     25    145     23     49     20     83     23     95     96     80    139     76     31     85
    185      4    238     21    102    154    126    188    203     21     22     96     19     94      0     23    102    153     84     29    202     21    154      6     31    106    120    239    117    144     80     17    115    189    190    174    234     20     64    179
    161     21    215      3     78    131    103    165    179      2     36     72      3     71     23      0     78    129     60      5    179     17    131     18     10     83     97    216     94    120     57     16     92    166    167    151    210      8     41    156
     83     99    137     81      4     53     25     86    101     80    112     22     82      9    102     78      0     51     20     73    101     91     55     97     73      6     18    137     15     43     29     91     22     87     89     72    132     84     40     78
     32    150     86    132     51      3     26     36     50    131    161     59    133     58    153    129     51      0     69    123     49    140     11    148    123     46     33     87     35      8     74    141     39     38     38     22     81    134     89     26
    101     81    154     63     18     71     42    104    119     62     92     16     64     11     84     60     20     69      0     54    118     71     70     79     54     23     36    156     34     60     11     72     32    106    106     91    150     65     20     95
    155     26    209      8     73    125     97    159    174      7     40     67      9     65     29      5     73    123     54      0    173     21    125     24      7     77     91    210     88    115     51     20     86    160    161    145    204     12     35    150
     17    199     36    181    100     48     76     18      7    180    209    107    182    107    202    179    101     49    118    173      0    189     48    197    172     96     82     39     85     58    123    190     87     21     11     29     31    183    138     22
    172     17    225     18     90    142    114    176    190     18     21     81     16     82     21     17     91    140     71     21    189      0    140     15     18     94    108    227    105    131     65      4    101    177    177    162    220      9     51    166
     32    151     84    133     53     14     31     39     51    132    161     59    134     60    154    131     55     11     70    125     48    140      0    149    123     49     37     87     40     14     74    142     39     41     37     27     80    135     90     26
    180      2    233     16     97    150    121    183    198     17     21     90     15     89      6     18     97    148     79     24    197     15    149      0     25    101    115    235    112    139     74     11    110    184    185    170    229     14     59    174
    155     28    208     13     72    125     96    158    173     12     38     64     13     65     31     10     73    123     54      7    172     18    123     25      0     77     90    210     88    114     49     18     84    160    160    145    203     11     33    149
     78    104    132     85      4     48     20     82     96     84    115     21     86     12    106     83      6     46     23     77     96     94     49    101     77      0     13    133     11     37     31     95     16     83     84     68    127     88     43     73
     65    118    119     99     18     34      6     68     83     98    129     31    100     25    120     97     18     33     36     91     82    108     37    115     90     13      0    119      2     24     44    109     16     69     71     54    114    102     57     59
     55    237     16    218    137     85    113     51     36    218    248    146    220    145    239    216    137     87    156    210     39    227     87    235    210    133    119      0    122     95    161    228    125     50     50     65     12    221    176     61
     67    115    122     96     15     37      9     71     85     95    126     29     97     23    117     94     15     35     34     88     85    105     40    112     88     11      2    122      0     27     41    106     15     72     73     57    116     99     54     62
     40    141     94    123     42     10     17     44     59    122    152     51    124     49    144    120     43      8     60    115     58    131     14    139    114     37     24     95     27      0     66    132     31     46     46     31     89    126     80     35
    106     77    159     59     26     76     49    110    124     58     86     15     60     20     80     57     29     74     11     51    123     65     74     74     49     31     44    161     41     66      0     67     35    112    111     97    155     61     15    100
    173     13    226     16     91    143    115    177    191     16     20     83     14     83     17     16     91    141     72     20    190      4    142     11     18     95    109    228    106    132     67      0    103    178    179    163    222      8     52    167
     70    112    123     94     18     42     17     75     89     94    122     20     95     23    115     92     22     39     32     86     87    101     39    110     84     16     16    125     15     31     35    103      0     77     76     62    119     96     51     64
     13    187     53    168     87     35     63      4     16    167    198     97    169     95    189    166     87     38    106    160     21    177     41    184    160     83     69     50     72     46    112    178     77      0     16     15     47    171    126     18
      6    188     48    169     89     36     64     12     14    169    198     96    171     96    190    167     89     38    106    161     11    177     37    185    160     84     71     50     73     46    111    179     76     16      0     19     43    172    126     11
     12    172     66    153     72     20     48     13     28    153    183     82    155     80    174    151     72     22     91    145     29    162     27    170    145     68     54     65     57     31     97    163     62     15     19      0     60    156    111     11
     49    231      7    213    132     79    107     47     31    212    241    139    214    139    234    210    132     81    150    204     31    220     80    229    203    127    114     12    116     89    155    222    119     47     43     60      0    215    170     54
    166     16    220      8     84    136    108    170    185      8     28     76      7     76     20      8     84    134     65     12    183      9    135     14     11     88    102    221     99    126     61      8     96    171    172    156    215      0     45    161
    121     61    174     43     39     91     63    125    139     43     72     31     44     31     64     41     40     89     20     35    138     51     90     59     33     43     57    176     54     80     15     52     51    126    126    111    170     45      0    115
      6    177     59    158     77     25     53     14     24    157    187     85    159     85    179    156     78     26     95    150     22    166     26    174    149     73     59     61     62     35    100    167     64     18     11     11     54    161    115      0