# bench EOLE photo, generated by bep version 0.1, generation model "A"
bEpInstance_A_20_13
     20     13    100   1000     30     60     50    250    100    4.0
      1     63    341     58    241    441     76
      2     61    334     34    234    434    209
      3     93    556     32    456    656     60
      4     16    115     55     15    215    233
      5     80    863     43    763    963     54
      6     35    866     31    766    966    194
      7     38    116     48     16    216    133
      8     57    432     56    332    532     90
      9     78    760     40    660    860    126
     10      9    486     35    386    586     54
     11      4    251     32    151    351     91
     12     37    906     33    806   1006     82
     13     77    554     35    454    654     74
     14     42    223     56    123    323    210
     15     34    444     36    344    544    232
     16     88     66     33    -34    166    180
     17     83    437     30    337    537    235
     18     93    207     59    107    307    243
     19     46     19     35    -81    119    215
     20     93    286     60    186    386    189
      0      1     54     57    130    131     56     22    104     38     26    141     53     29     26     69     24     34     80     15
      1      0     56     55    132    133     54     24    106     40     25    143     55     28     28     67     26     32     78     14
     54     56      0    111     76     78    110     32     51     27     79     88      4     84     31    122     29     87    134     67
     57     55    111      0    187    187      5     79    161     92     34    197    110     27     82     21     82     29     25     46
    130    132     76    187      0     11    187    107     25     95    154     15     77    160    105    199    106    164    211    144
    131    133     78    187     11      0    187    108     28     95    153     10     78    160    105    200    107    165    211    145
     56     54    110      5    187    187      0     79    161     92     34    197    109     26     82     17     81     26     24     44
     22     24     32     79    107    108     79      0     82     18     47    118     30     52      6     91      6     56    103     37
    104    106     51    161     25     28    161     82      0     70    128     37     51    134     79    173     80    138    185    118
     38     40     27     92     95     95     92     18     70      0     58    105     24     66     12    106     22     72    117     54
     26     25     79     34    154    153     34     47    128     58      0    163     77     11     48     50     50     24     58     23
    141    143     88    197     15     10    197    118     37    105    163      0     88    170    115    210    117    175    221    155
     53     55      4    110     77     78    109     30     51     24     77     88      0     83     29    122     29     86    133     67
     29     28     84     27    160    160     26     52    134     66     11    170     83      0     55     40     54     13     51     20
     26     28     31     82    105    105     82      6     79     12     48    115     29     55      0     95     12     61    106     42
     69     67    122     21    199    200     17     91    173    106     50    210    122     40     95      0     92     35     15     55
     24     26     29     82    106    107     81      6     80     22     50    117     29     54     12     92      0     57    104     37
     34     32     87     29    164    165     26     56    138     72     24    175     86     13     61     35     57      0     48     19
     80     78    134     25    211    211     24    103    185    117     58    221    133     51    106     15    104     48      0     67
     15     14     67     46    144    145     44     37    118     54     23    155     67     20     42     55     37     19     67      0