# bench EOLE photo, generated by bep version 0.1, generation model "A"
bEpInstance_A_50_4
     50      4    100   1000     30     60     50    250    100    4.0
      1     92    134     35     34    234    102
      2     21    360     43    260    460    181
      3     19    310     45    210    410     73
      4     57    670     58    570    770    109
      5     68     10     52    -90    110     69
      6     23    158     53     58    258    234
      7     35    343     38    243    443    190
      8     28    661     56    561    761     89
      9     80     56     44    -44    156     51
     10     42    878     50    778    978    172
     11     18    169     52     69    269    202
     12     84    653     31    553    753    154
     13     66    780     49    680    880    230
     14     94    366     55    266    466    107
     15     71     73     60    -27    173    249
     16     74    851     35    751    951    156
     17     91    648     46    548    748    115
     18     53    200     58    100    300    193
     19     37    660     44    560    760     92
     20     31    528     52    428    628    245
     21     31    349     57    249    449     99
     22     72    686     46    586    786    135
     23     76    520     42    420    620    149
     24     37    606     30    506    706    105
     25     25    559     48    459    659    206
     26     76    536     45    436    636     75
     27     19    966     40    866   1066    152
     28     49     69     44    -31    169    211
     29     42    354     31    254    454     77
     30      4    581     47    481    681    210
     31     10    977     39    877   1077    144
     32     58    314     53    214    414    217
     33     88    351     49    251    451    176
     34     89    108     53      8    208     66
     35      7     98     48     -2    198    163
     36     16     73     41    -27    173    167
     37     43    415     52    315    515    144
     38    100    281     38    181    381     69
     39     26    560     47    460    660    218
     40     88    316     50    216    416    199
     41     67    290     41    190    390    161
     42     40    137     49     37    237    144
     43     23    227     31    127    327    130
     44     30    406     60    306    506    196
     45     83    712     36    612    812    214
     46    100    465     58    365    565    100
     47      2    483     32    383    583    230
     48     80    766     49    666    866    143
     49      5     21     30    -79    121    141
     50     15    657     58    557    757    129
      0     59     47    134     31     18     54    132     19    186     20    129    161     58     16    179    128     19    132     99     55    138     96    118    107    100    208     19     56    113    211     45     54      6     23     24     71     36    107     45     39     13     28     69    144     82     90    158     35    132
     59      0     12     78     88     50      5     75     77    129     47     74    105     18     72    123     74     40     75     42      3     82     42     61     49     46    151     73      5     55    154     14     16     65     65     71     14     27     50     20     20     55     33     11     89     32     31    102     84     74
     47     12      0     90     75     38      9     87     65    142     35     87    118     23     60    135     86     28     87     54     10     94     54     74     62     58    164     60     12     67    166      9     20     53     53     59     26     21     62     17     13     43     20     24    101     43     43    115     72     86
    134     78     90      0    165    128     81      7    153     52    125      7     27     76    149     45     10    117      5     36     80      5     37     16     28     33     74    150     79     25     77     89     80    140    143    149     63     97     28     88     95    133    111     66     12     52     48     24    162     10
     31     88     75    165      0     38     83    163     11    217     41    160    192     89     15    210    159     47    162    129     85    169    127    149    137    131    239     15     86    143    242     76     85     25     26     20    101     68    137     76     70     32     55     99    175    114    119    189     15    162
     18     50     38    128     38      0     46    125     29    180      3    124    155     54     24    173    123     12    125     92     47    132     91    112    100     95    202     23     49    105    204     39     50     20     15     21     64     36    100     42     34      6     17     62    139     79     81    152     34    124
     54      5      9     81     83     46      0     79     72    133     43     78    109     15     68    127     77     36     79     46      1     86     45     65     54     49    155     68      3     60    158      9     13     60     61     67     18     22     54     14     15     51     29     15     93     34     35    106     80     78
    132     75     87      7    163    125     79      0    151     54    123     14     31     75    147     48     16    115      2     33     78     12     37     13     25     33     76    148     76     20     79     87     78    139    140    147     61     96     25     87     93    131    108     63     18     52     44     29    160      3
     19     77     65    153     11     29     72    151      0    205     32    149    181     77      4    198    148     36    151    118     74    157    116    137    126    120    228      8     75    132    230     64     73     13     21     16     90     56    126     65     58     22     45     88    164    102    108    177     20    151
    186    129    142     52    217    180    133     54    205      0    177     57     25    128    201     10     58    169     54     87    132     48     89     68     79     85     22    202    131     74     26    141    132    192    195    201    115    149     79    140    147    185    162    118     42    104     99     29    214     55
     20     47     35    125     41      3     43    123     32    177      0    122    153     52     27    171    121     11    122     89     45    129     88    109     97     92    199     26     46    103    202     37     48     23     17     24     61     34     97     40     32      9     14     59    136     76     78    150     37    122
    129     74     87      7    160    124     78     14    149     57    122      0     32     71    145     49      2    113     11     33     77      8     33     16     27     29     79    146     75     26     83     84     75    136    140    145     60     93     27     84     90    129    107     63     14     47     47     28    159     17
    161    105    118     27    192    155    109     31    181     25    153     32      0    103    176     17     33    145     30     63    108     23     65     44     56     61     47    177    106     52     51    116    107    168    171    177     91    125     55    116    122    160    138     93     17     79     75      4    190     33
     58     18     23     76     89     54     15     75     77    128     52     71    103      0     73    121     70     42     74     43     16     80     38     61     51     42    151     75     13     58    154     15      4     64     70     75     17     21     51     12     20     58     39     18     86     24     37    100     89     75
     16     72     60    149     15     24     68    147      4    201     27    145    176     73      0    194    143     32    146    114     69    153    111    133    122    115    223      5     70    128    226     60     69      9     17     13     85     52    122     60     54     17     40     83    159     98    103    173     21    146
    179    123    135     45    210    173    127     48    198     10    171     49     17    121    194      0     50    162     48     81    125     41     82     61     74     78     31    195    124     69     35    134    125    185    188    195    109    142     73    133    140    178    156    111     34     96     93     21    208     50
    128     74     86     10    159    123     77     16    148     58    121      2     33     70    143     50      0    112     13     33     76     10     32     17     27     28     81    145     74     27     84     83     74    135    139    144     59     91     27     83     89    128    106     62     16     45     46     29    158     19
     19     40     28    117     47     12     36    115     36    169     11    113    145     42     32    162    112      0    115     82     37    121     80    101     90     84    191     32     38     96    194     28     38     24     27     33     53     23     90     30     22     16     10     51    128     67     71    141     46    114
    132     75     87      5    162    125     79      2    151     54    122     11     30     74    146     48     13    115      0     33     77     10     36     13     25     32     76    147     76     21     79     86     78    138    140    146     61     96     25     86     92    130    108     63     17     51     45     28    159      5
     99     42     54     36    129     92     46     33    118     87     89     33     63     43    114     81     33     82     33      0     44     40     11     19      7     11    109    114     43     14    112     53     46    105    107    113     28     64      8     54     60     97     75     30     47     23     13     60    126     32
     55      3     10     80     85     47      1     78     74    132     45     77    108     16     69    125     76     37     77     44      0     84     44     64     52     48    154     70      3     58    157     11     14     61     63     69     16     24     52     16     17     53     30     14     91     33     34    104     82     77
    138     82     94      5    169    132     86     12    157     48    129      8     23     80    153     41     10    121     10     40     84      0     41     21     33     37     71    154     83     31     74     93     83    144    147    153     68    101     33     92     99    137    115     70      7     55     53     20    167     15
     96     42     54     37    127     91     45     37    116     89     88     33     65     38    111     82     32     80     36     11     44     41      0     23     16      4    112    112     42     23    115     51     42    103    106    112     27     60     16     51     57     96     74     30     48     15     20     61    126     37
    118     61     74     16    149    112     65     13    137     68    109     16     44     61    133     61     17    101     13     19     64     21     23      0     12     20     90    134     63     10     92     73     65    125    127    133     47     82     11     73     79    117     94     50     28     38     31     41    146     13
    107     49     62     28    137    100     54     25    126     79     97     27     56     51    122     74     27     90     25      7     52     33     16     12      0     13    101    122     51      7    104     61     54    113    115    121     36     71      0     62     68    105     83     38     40     30     19     53    134     24
    100     46     58     33    131     95     49     33    120     85     92     29     61     42    115     78     28     84     32     11     48     37      4     20     13      0    108    116     46     21    111     55     46    107    110    116     31     64     13     55     61    100     78     34     44     18     22     57    129     33
    208    151    164     74    239    202    155     76    228     22    199     79     47    151    223     31     81    191     76    109    154     71    112     90    101    108      0    224    153     96      3    163    154    215    217    223    137    172    101    163    169    207    184    140     65    126    120     52    236     77
     19     73     60    150     15     23     68    148      8    202     26    146    177     75      5    195    145     32    147    114     70    154    112    134    122    116    224      0     71    128    227     61     71     13     12      8     86     54    122     62     55     17     40     84    160     99    104    174     16    147
     56      5     12     79     86     49      3     76     75    131     46     75    106     13     70    124     74     38     76     43      3     83     42     63     51     46    153     71      0     57    155     10     11     62     64     70     15     23     51     14     17     54     32     13     90     31     33    103     83     76
    113     55     67     25    143    105     60     20    132     74    103     26     52     58    128     69     27     96     21     14     58     31     23     10      7     21     96    128     57      0     99     68     61    120    120    127     42     78      7     69     74    111     88     44     38     37     24     50    140     19
    211    154    166     77    242    204    158     79    230     26    202     83     51    154    226     35     84    194     79    112    157     74    115     92    104    111      3    227    155     99      0    166    157    218    219    226    140    175    104    166    172    210    187    142     68    129    123     55    239     80
     45     14      9     89     76     39      9     87     64    141     37     84    116     15     60    134     83     28     86     53     11     93     51     73     61     55    163     61     10     68    166      0     11     52     55     61     25     13     62      7      6     44     23     24     99     39     44    113     74     86
     54     16     20     80     85     50     13     78     73    132     48     75    107      4     69    125     74     38     78     46     14     83     42     65     54     46    154     71     11     61    157     11      0     60     66     71     19     17     54      8     16     54     35     19     90     28     39    103     85     78
      6     65     53    140     25     20     60    139     13    192     23    136    168     64      9    185    135     24    138    105     61    144    103    125    113    107    215     13     62    120    218     52     60      0     20     20     77     43    114     52     45     14     34     75    151     89     96    164     30    138
     23     65     53    143     26     15     61    140     21    195     17    140    171     70     17    188    139     27    140    107     63    147    106    127    115    110    217     12     64    120    219     55     66     20      0      6     79     51    115     58     50     12     32     77    154     94     96    167     19    139
     24     71     59    149     20     21     67    147     16    201     24    145    177     75     13    195    144     33    146    113     69    153    112    133    121    116    223      8     70    127    226     61     71     20      6      0     85     56    121     63     55     17     38     83    160    100    102    173     13    146
     71     14     26     63    101     64     18     61     90    115     61     60     91     17     85    109     59     53     61     28     16     68     27     47     36     31    137     86     15     42    140     25     19     77     79     85      0     36     36     27     31     69     47      3     74     18     19     88     98     60
     36     27     21     97     68     36     22     96     56    149     34     93    125     21     52    142     91     23     96     64     24    101     60     82     71     64    172     54     23     78    175     13     17     43     51     56     36      0     72      9      8     39     23     35    107     46     56    121     69     96
    107     50     62     28    137    100     54     25    126     79     97     27     55     51    122     73     27     90     25      8     52     33     16     11      0     13    101    122     51      7    104     62     54    114    115    121     36     72      0     62     68    105     83     38     40     30     20     53    134     24
     45     20     17     88     76     42     14     87     65    140     40     84    116     12     60    133     83     30     86     54     16     92     51     73     62     55    163     62     14     69    166      7      8     52     58     63     27      9     62      0      8     46     27     26     99     37     46    112     76     87
     39     20     13     95     70     34     15     93     58    147     32     90    122     20     54    140     89     22     92     60     17     99     57     79     68     61    169     55     17     74    172      6     16     45     50     55     31      8     68      8      0     38     19     30    105     44     50    119     69     92
     13     55     43    133     32      6     51    131     22    185      9    129    160     58     17    178    128     16    130     97     53    137     96    117    105    100    207     17     54    111    210     44     54     14     12     17     69     39    105     46     38      0     22     67    144     83     87    157     30    130
     28     33     20    111     55     17     29    108     45    162     14    107    138     39     40    156    106     10    108     75     30    115     74     94     83     78    184     40     32     88    187     23     35     34     32     38     47     23     83     27     19     22      0     44    122     62     64    135     51    107
     69     11     24     66     99     62     15     63     88    118     59     63     93     18     83    111     62     51     63     30     14     70     30     50     38     34    140     84     13     44    142     24     19     75     77     83      3     35     38     26     30     67     44      0     77     22     20     90     96     62
    144     89    101     12    175    139     93     18    164     42    136     14     17     86    159     34     16    128     17     47     91      7     48     28     40     44     65    160     90     38     68     99     90    151    154    160     74    107     40     99    105    144    122     77      0     61     60     13    173     21
     82     32     43     52    114     79     34     52    102    104     76     47     79     24     98     96     45     67     51     23     33     55     15     38     30     18    126     99     31     37    129     39     28     89     94    100     18     46     30     37     44     83     62     22     61      0     24     75    113     52
     90     31     43     48    119     81     35     44    108     99     78     47     75     37    103     93     46     71     45     13     34     53     20     31     19     22    120    104     33     24    123     44     39     96     96    102     19     56     20     46     50     87     64     20     60     24      0     73    115     43
    158    102    115     24    189    152    106     29    177     29    150     28      4    100    173     21     29    141     28     60    104     20     61     41     53     57     52    174    103     50     55    113    103    164    167    173     88    121     53    112    119    157    135     90     13     75     73      0    187     31
     35     84     72    162     15     34     80    160     20    214     37    159    190     89     21    208    158     46    159    126     82    167    126    146    134    129    236     16     83    140    239     74     85     30     19     13     98     69    134     76     69     30     51     96    173    113    115    187      0    159
    132     74     86     10    162    124     78      3    151     55    122     17     33     75    146     50     19    114      5     32     77     15     37     13     24     33     77    147     76     19     80     86     78    138    139    146     60     96     24     87     92    130    107     62     21     52     43     31    159      0