# bench EOLE photo, generated by bep version 0.1, generation model "A"
bEpInstance_A_15_58
     15     58    100   1000     30     60     50    250    100    4.0
      1     77    938     30    838   1038     58
      2     65    781     58    681    881    166
      3     18    878     30    778    978    120
      4     23    462     44    362    562    173
      5     48    775     34    675    875    216
      6     64     83     36    -17    183    241
      7     75    221     32    121    321    100
      8     27    597     33    497    697     57
      9     53    157     32     57    257     86
     10     94    994     53    894   1094     75
     11     88    780     44    680    880     71
     12     24    947     52    847   1047    195
     13     72    875     47    775    975    121
     14     96    753     39    653    853    191
     15     98    384     59    284    484     99
      0     39     21    119     41    213    179     86    195     14     39     13     15     46    138
     39      0     26     80      4    174    140     46    156     53      5     42     23     10     99
     21     26      0    104     26    199    164     70    180     34     30     17     13     36    125
    119     80    104      0     78     95     61     33     76    134     81    121    103     75     27
     41      4     26     78      0    173    138     44    154     55     10     43     25     13     98
    213    174    199     95    173      0     34    128     18    227    174    216    198    167     75
    179    140    164     61    138     34      0     94     16    193    139    181    163    133     41
     86     46     70     33     44    128     94      0    110    100     48     87     70     42     56
    195    156    180     76    154     18     16    110      0    209    155    197    179    149     57
     14     53     34    134     55    227    193    100    209      0     53     21     30     60    152
     39      5     30     81     10    174    139     48    155     53      0     44     24      7     99
     13     42     17    121     43    216    181     87    197     21     44      0     21     51    141
     15     23     13    103     25    198    163     70    179     30     24     21      0     31    122
     46     10     36     75     13    167    133     42    149     60      7     51     31      0     92
    138     99    125     27     98     75     41     56     57    152     99    141    122     92      0