# bench EOLE photo, generated by bep version 0.1, generation model "A"
bEpInstance_A_10_73
     10     73    100   1000     30     60     50    250    100    4.0
      1     13    128     47     28    228    218
      2     15     85     39    -15    185    150
      3     76    640     50    540    740    104
      4     75    228     40    128    328    149
      5     70    724     46    624    824    199
      6     70    632     36    532    732    250
      7     67    393     36    293    493     82
      8     14    276     40    176    376    105
      9     40    904     33    804   1004    162
     10     99    438     31    338    538    200
      0     10    128     29    149    126     67     37    194     80
     10      0    139     38    160    137     78     47    204     90
    128    139      0    103     21      2     61     92     66     50
     29     38    103      0    124    101     41     19    169     52
    149    160     21    124      0     23     82    112     45     71
    126    137      2    101     23      0     59     90     68     49
     67     78     61     41     82     59      0     32    127     13
     37     47     92     19    112     90     32      0    157     45
    194    204     66    169     45     68    127    157      0    117
     80     90     50     52     71     49     13     45    117      0