# bench EOLE photo, generated by bep version 0.1, generation model "A"
bEpInstance_A_15_29
     15     29    100   1000     30     60     50    250    100    4.0
      1     88    462     53    362    562    102
      2     57    380     43    280    480    156
      3     83    926     53    826   1026     82
      4     10    967     36    867   1067    208
      5     22    617     47    517    717     79
      6     54    765     40    665    865    190
      7     59    331     45    231    431    168
      8     60    510     38    410    610    145
      9     98     23     52    -77    123    158
     10     40    185     32     85    285     97
     11     11    815     42    715    915     92
     12     78    613     30    513    713     51
     13     23    555     34    455    655    205
     14     32    476     44    376    576    232
     15     81    977     45    877   1077    132
      0     21    116    127     42     76     33     13    109     70     90     37     28     14    128
     21      0    136    147     59     96     12     32     89     48    109     58     44     24    149
    116    136      0     20     78     40    148    104    225    185     33     78     93    113     12
    127    147     20      0     87     51    159    114    237    195     38     90    103    122     17
     42     59     78     87      0     37     72     28    149    108     49     14     15     35     91
     76     96     40     51     37      0    108     63    185    145     16     38     53     72     53
     33     12    148    159     72    108      0     44     77     36    121     70     56     36    161
     13     32    104    114     28     63     44      0    122     81     77     26     14     11    116
    109     89    225    237    149    185     77    122      0     43    199    147    134    114    238
     70     48    185    195    108    145     36     81     43      0    157    107     92     72    198
     90    109     33     38     49     16    121     77    199    157      0     53     65     84     44
     37     58     78     90     14     38     70     26    147    107     53      0     19     36     91
     28     44     93    103     15     53     56     14    134     92     65     19      0     19    106
     14     24    113    122     35     72     36     11    114     72     84     36     19      0    125
    128    149     12     17     91     53    161    116    238    198     44     91    106    125      0