seq_id	180912_PM_PEL_Tey_f20_rbcL-2354;size=2	180912_PM_PEL_Tey_f20_rbcL-4999;size=1	180912_PM_PEL_Tey_f20_rbcL-7887;size=1	180912_PM_PEL_Tey_f20_rbcL-8282;size=1	180912_PM_PEL_Tey_f20_rbcL-8424;size=1	180912_PM_PEL_Tey_f20_rbcL-9471;size=1	180912_PM_PEL_Tey_f20_rbcL-10670;size=1	180912_PM_PEL_Tey_f20_rbcL-10725;size=1	180912_PM_PEL_Tey_f20_rbcL-11567;size=1	180912_PM_PEL_Tey_f20_rbcL-11657;size=1	180912_PM_PEL_Tey_f20_rbcL-12578;size=1	180912_PM_PEL_Tey_f20_rbcL-14526;size=1	180912_PM_PEL_Tey_f20_rbcL-15928;size=1	180912_PM_PEL_Tey_f20_rbcL-17211;size=1	180912_PM_PEL_Tey_f20_rbcL-18773;size=1	180912_PM_PEL_Tey_f20_rbcL-19873;size=1	180912_PM_PEL_Tey_f20_rbcL-21823;size=1
180912_PM_PEL_Tey_f20_rbcL-2354;size=2	0.0	4.0	2.0	4.0	8.5	6.0	5.5	3.0	5.5	1.5	3.0	1.75	3.5	4.5	6.0	6.25	7.75
180912_PM_PEL_Tey_f20_rbcL-4999;size=1	4.0	0.0	6.0	2.0	7.0	2.0	4.0	5.0	4.0	5.5	5.0	5.75	5.5	2.5	4.5	4.75	5.75
180912_PM_PEL_Tey_f20_rbcL-7887;size=1	2.0	6.0	0.0	6.0	8.5	8.0	5.5	3.0	7.5	3.5	3.0	3.75	3.5	6.5	6.0	6.25	7.75
180912_PM_PEL_Tey_f20_rbcL-8282;size=1	4.0	2.0	6.0	0.0	7.0	2.0	4.0	3.0	4.0	5.5	5.0	5.75	5.5	4.5	4.5	4.75	5.75
180912_PM_PEL_Tey_f20_rbcL-8424;size=1	8.5	7.0	8.5	7.0	0.0	7.0	3.0	7.5	5.0	8.0	5.5	10.25	8.0	9.5	5.5	3.75	8.75
180912_PM_PEL_Tey_f20_rbcL-9471;size=1	6.0	2.0	8.0	2.0	7.0	0.0	4.0	5.0	4.0	5.5	5.0	7.75	7.5	4.5	6.5	4.75	7.75
180912_PM_PEL_Tey_f20_rbcL-10670;size=1	5.5	4.0	5.5	4.0	3.0	4.0	0.0	4.5	2.0	5.0	2.5	7.25	5.0	6.5	2.5	0.75	5.75
180912_PM_PEL_Tey_f20_rbcL-10725;size=1	3.0	5.0	3.0	3.0	7.5	5.0	4.5	0.0	6.5	4.5	2.0	4.75	2.5	7.5	5.0	5.25	6.75
180912_PM_PEL_Tey_f20_rbcL-11567;size=1	5.5	4.0	7.5	4.0	5.0	4.0	2.0	6.5	0.0	5.5	4.5	7.25	6.25	5.75	3.75	2.75	7.0
180912_PM_PEL_Tey_f20_rbcL-11657;size=1	1.5	5.5	3.5	5.5	8.0	5.5	5.0	4.5	5.5	0.0	2.5	3.25	5.0	6.0	7.5	5.75	9.25
180912_PM_PEL_Tey_f20_rbcL-12578;size=1	3.0	5.0	3.0	5.0	5.5	5.0	2.5	2.0	4.5	2.5	0.0	4.75	2.5	7.5	5.0	3.25	6.75
180912_PM_PEL_Tey_f20_rbcL-14526;size=1	1.75	5.75	3.75	5.75	10.25	7.75	7.25	4.75	7.25	3.25	4.75	0.75	4.5	5.5	7.0	7.25	8.75
180912_PM_PEL_Tey_f20_rbcL-15928;size=1	3.5	5.5	3.5	5.5	8.0	7.5	5.0	2.5	6.25	5.0	2.5	4.5	1.5	6.5	4.0	5.0	5.75
180912_PM_PEL_Tey_f20_rbcL-17211;size=1	4.5	2.5	6.5	4.5	9.5	4.5	6.5	7.5	5.75	6.0	7.5	5.5	6.5	1.5	5.5	6.5	6.75
180912_PM_PEL_Tey_f20_rbcL-18773;size=1	6.0	4.5	6.0	4.5	5.5	6.5	2.5	5.0	3.75	7.5	5.0	7.0	4.0	5.5	1.5	2.5	4.75
180912_PM_PEL_Tey_f20_rbcL-19873;size=1	6.25	4.75	6.25	4.75	3.75	4.75	0.75	5.25	2.75	5.75	3.25	7.25	5.0	6.5	2.5	0.75	5.75
180912_PM_PEL_Tey_f20_rbcL-21823;size=1	7.75	5.75	7.75	5.75	8.75	7.75	5.75	6.75	7.0	9.25	6.75	8.75	5.75	6.75	4.75	5.75	3.75
