seq_id	180912_PM_PEL_Tey_f20_rbcL-2153;size=2	180912_PM_PEL_Tey_f20_rbcL-3367;size=2	180912_PM_PEL_Tey_f20_rbcL-4844;size=1	180912_PM_PEL_Tey_f20_rbcL-5623;size=1	180912_PM_PEL_Tey_f20_rbcL-9158;size=1	180912_PM_PEL_Tey_f20_rbcL-9285;size=1	180912_PM_PEL_Tey_f20_rbcL-10624;size=1	180912_PM_PEL_Tey_f20_rbcL-11126;size=1	180912_PM_PEL_Tey_f20_rbcL-11312;size=1	180912_PM_PEL_Tey_f20_rbcL-12385;size=1	180912_PM_PEL_Tey_f20_rbcL-13594;size=1	180912_PM_PEL_Tey_f20_rbcL-13595;size=1	180912_PM_PEL_Tey_f20_rbcL-13837;size=1	180912_PM_PEL_Tey_f20_rbcL-15003;size=1	180912_PM_PEL_Tey_f20_rbcL-18799;size=1	180912_PM_PEL_Tey_f20_rbcL-18834;size=1	180912_PM_PEL_Tey_f20_rbcL-19503;size=1	180912_PM_PEL_Tey_f20_rbcL-23997;size=1
180912_PM_PEL_Tey_f20_rbcL-2153;size=2	0.0	6.5	11.0	4.5	4.0	5.0	4.5	4.0	5.0	3.5	6.0	11.0	5.0	4.25	5.5	4.5	5.75	3.75
180912_PM_PEL_Tey_f20_rbcL-3367;size=2	6.5	1.5	11.5	7.5	2.5	5.5	7.5	10.5	3.5	6.5	4.5	10.0	3.25	4.5	8.5	7.5	3.5	9.5
180912_PM_PEL_Tey_f20_rbcL-4844;size=1	11.0	11.5	0.0	10.0	9.0	6.0	8.0	11.0	12.0	9.0	7.0	9.0	8.0	11.75	12.5	11.5	8.75	12.75
180912_PM_PEL_Tey_f20_rbcL-5623;size=1	4.5	7.5	10.0	0.0	5.0	4.0	2.0	6.5	6.0	3.0	5.0	8.5	4.0	3.75	8.0	7.0	4.75	8.25
180912_PM_PEL_Tey_f20_rbcL-9158;size=1	4.0	2.5	9.0	5.0	0.0	3.0	5.0	8.0	3.0	4.0	4.0	9.5	1.0	2.75	7.5	6.5	3.75	7.75
180912_PM_PEL_Tey_f20_rbcL-9285;size=1	5.0	5.5	6.0	4.0	3.0	0.0	2.0	5.0	6.0	3.0	1.0	6.5	2.0	5.75	6.5	5.5	2.75	6.75
180912_PM_PEL_Tey_f20_rbcL-10624;size=1	4.5	7.5	8.0	2.0	5.0	2.0	0.0	4.5	6.0	1.0	3.0	6.5	4.0	3.75	8.0	7.0	4.75	6.25
180912_PM_PEL_Tey_f20_rbcL-11126;size=1	4.0	10.5	11.0	6.5	8.0	5.0	4.5	0.0	9.0	5.5	6.0	11.0	7.0	8.25	7.5	6.5	7.75	5.75
180912_PM_PEL_Tey_f20_rbcL-11312;size=1	5.0	3.5	12.0	6.0	3.0	6.0	6.0	9.0	0.0	5.0	5.0	10.5	4.0	3.75	10.5	9.5	4.75	8.75
180912_PM_PEL_Tey_f20_rbcL-12385;size=1	3.5	6.5	9.0	3.0	4.0	3.0	1.0	5.5	5.0	0.0	4.0	7.5	5.0	2.75	9.0	8.0	5.75	5.25
180912_PM_PEL_Tey_f20_rbcL-13594;size=1	6.0	4.5	7.0	5.0	4.0	1.0	3.0	6.0	5.0	4.0	0.0	5.5	3.0	6.75	7.5	6.5	1.75	7.75
180912_PM_PEL_Tey_f20_rbcL-13595;size=1	11.0	10.0	9.0	8.5	9.5	6.5	6.5	11.0	10.5	7.5	5.5	0.0	8.5	10.25	12.5	11.5	7.25	12.75
180912_PM_PEL_Tey_f20_rbcL-13837;size=1	5.0	3.25	8.0	4.0	1.0	2.0	4.0	7.0	4.0	5.0	3.0	8.5	0.0	3.5	6.25	5.25	2.5	8.5
180912_PM_PEL_Tey_f20_rbcL-15003;size=1	4.25	4.5	11.75	3.75	2.75	5.75	3.75	8.25	3.75	2.75	6.75	10.25	3.5	0.75	9.0	8.0	5.75	7.25
180912_PM_PEL_Tey_f20_rbcL-18799;size=1	5.5	8.5	12.5	8.0	7.5	6.5	8.0	7.5	10.5	9.0	7.5	12.5	6.25	9.0	1.5	4.5	6.5	8.5
180912_PM_PEL_Tey_f20_rbcL-18834;size=1	4.5	7.5	11.5	7.0	6.5	5.5	7.0	6.5	9.5	8.0	6.5	11.5	5.25	8.0	4.5	1.5	5.5	7.5
180912_PM_PEL_Tey_f20_rbcL-19503;size=1	5.75	3.5	8.75	4.75	3.75	2.75	4.75	7.75	4.75	5.75	1.75	7.25	2.5	5.75	6.5	5.5	0.75	8.75
180912_PM_PEL_Tey_f20_rbcL-23997;size=1	3.75	9.5	12.75	8.25	7.75	6.75	6.25	5.75	8.75	5.25	7.75	12.75	8.5	7.25	8.5	7.5	8.75	0.75
