# bench EOLE photo, generated by bep version 0.1, generation model "A"
bEpInstance_A_10_99
     10     99    100   1000     30     60     50    250    100    4.0
      1     46    875     59    775    975    184
      2     44    837     36    737    937    186
      3     21    850     58    750    950    249
      4     19     85     33    -15    185    242
      5     43    115     32     15    215    144
      6     10    564     45    464    664     84
      7     16    877     35    777    977    106
      8      7    974     42    874   1074    156
      9     85    339     36    239    439    108
     10     17    413     60    313    513    128
      0      9      8    197    190     78      7     26    134    115
      9      0      6    188    180     68     12     35    124    106
      8      6      0    191    183     71      6     31    128    109
    197    188    191      0      9    119    198    222     65     82
    190    180    183      9      0    112    190    214     56     74
     78     68     71    119    112      0     78    102     59     37
      7     12      6    198    190     78      0     24    135    116
     26     35     31    222    214    102     24      0    159    140
    134    124    128     65     56     59    135    159      0     25
    115    106    109     82     74     37    116    140     25      0