# bench EOLE photo, generated by bep version 0.1, generation model "A"
bEpInstance_A_10_16
     10     16    100   1000     30     60     50    250    100    4.0
      1     21     89     39    -11    189    170
      2     93      8     37    -92    108    189
      3     36    823     33    723    923    161
      4     38    288     55    188    388    112
      5     86    679     31    579    779     56
      6      9    305     35    205    405    123
      7     10    590     38    490    690     58
      8     89    921     53    821   1021     70
      9      1     73     51    -27    173    237
     10      8    951     49    851   1051    138
      0     27    183     49    148     54    125    208      6    215
     27      0    204     71    167     77    146    228     28    236
    183    204      0    133     38    129     58     27    187     32
     49     71    133      0     98      8     75    158     54    165
    148    167     38     98      0     95     29     60    152     70
     54     77    129      8     95      0     71    155     58    161
    125    146     58     75     29     71      0     85    129     90
    208    228     27    158     60    155     85      0    213     21
      6     28    187     54    152     58    129    213      0    219
    215    236     32    165     70    161     90     21    219      0