# bench EOLE photo, generated by bep version 0.1, generation model "A"
bEpInstance_A_40_99
     40     99    100   1000     30     60     50    250    100    4.0
      1     46    875     59    775    975    184
      2     44    837     36    737    937    186
      3     21    850     58    750    950    249
      4     19     85     33    -15    185    242
      5     43    115     32     15    215    144
      6     10    564     45    464    664     84
      7     16    877     35    777    977    106
      8      7    974     42    874   1074    156
      9     85    339     36    239    439    108
     10     17    413     60    313    513    128
     11     26    876     41    776    976    141
     12     97    512     42    412    612    128
     13     63    492     56    392    592    197
     14      5    376     58    276    476     94
     15     25     94     45     -6    194    115
     16      6    902     56    802   1002    234
     17     24     55     36    -45    155    133
     18     47    181     54     81    281    197
     19      5    189     35     89    289     53
     20     70    598     42    498    698    116
     21      9    270     31    170    370     79
     22     65    972     41    872   1072    230
     23      6    875     36    775    975     77
     24     78     79     31    -21    179     53
     25     13    259     43    159    359    171
     26     44    236     40    136    336    149
     27     42    521     45    421    621     75
     28     12    924     44    824   1024     92
     29     19    519     41    419    619    218
     30     49    728     52    628    828    162
     31     60    960     51    860   1060    125
     32      3    743     42    643    843     84
     33      0    823     54    723    923    139
     34      5    112     59     12    212    147
     35     63    454     48    354    554    201
     36     38     66     59    -34    166    164
     37     59    319     42    219    419     65
     38      4    146     49     46    246    180
     39     10    326     30    226    426     79
     40      6    418     39    318    518     64
      0      9      8    197    190     78      7     26    134    115      5     91     95    125    195     12    205    173    171     69    151     24     10    199    154    159     88     14     89     36     21     34     17    191    105    202    139    182    137    114
      9      0      6    188    180     68     12     35    124    106     10     82     86    115    185     18    195    164    162     60    142     34     13    189    144    150     79     23     79     27     31     25     11    181     95    192    129    173    128    105
      8      6      0    191    183     71      6     31    128    109      6     86     90    118    189     13    198    167    165     64    145     32      7    193    147    153     82     18     82     31     29     27      8    184     99    196    133    176    131    108
    197    188    191      0      9    119    198    222     65     82    197    108    102     72      2    204      7     25     26    128     46    222    197     14     43     38    109    209    108    160    218    164    184      7     92      6     59     15     60     83
    190    180    183      9      0    112    190    214     56     74    190    100     94     65      6    196     15     16     20    120     39    214    190     12     36     30    101    202    101    153    211    157    177      9     84     12     51     12     53     76
     78     68     71    119    112      0     78    102     59     37     78     25     22     47    117     84    127     96     93     17     73    102     77    122     76     82     13     90     11     42     99     44     64    113     30    124     62    104     59     36
      7     12      6    198    190     78      0     24    135    116      2     93     96    125    195      6    205    174    172     71    151     26      2    200    154    160     89     11     89     38     23     33     14    191    106    202    139    182    137    114
     26     35     31    222    214    102     24      0    159    140     24    117    121    149    220     18    229    198    196     95    176     14     24    224    178    184    113     12    113     62     13     57     37    215    130    227    164    207    162    139
    134    124    128     65     56     59    135    159      0     25    135     43     38     22     63    142     72     40     42     64     25    158    135     65     26     27     46    147     47     97    155    103    122     60     29     69      8     52     19     27
    115    106    109     82     74     37    116    140     25      0    115     31     22      9     79    122     89     58     56     48     35    140    115     84     38     44     27    127     26     79    137     82    102     75     15     86     25     66     21      3
      5     10      6    197    190     78      2     24    135    115      0     92     96    125    195      8    205    173    171     70    151     25      5    199    154    160     88     12     89     37     22     33     14    191    105    202    139    182    137    114
     91     82     86    108    100     25     93    117     43     31     92      0      9     41    106    100    115     83     83     22     64    115     93    108     66     70     13    105     19     55    112     62     81    102     16    112     49     94     51     32
     95     86     90    102     94     22     96    121     38     22     96      9      0     32     99    103    109     77     77     26     57    120     96    103     59     64      8    108     12     59    117     64     84     96      9    106     43     87     43     23
    125    115    118     72     65     47    125    149     22      9    125     41     32      0     70    131     80     49     46     57     26    149    124     76     29     36     37    137     35     88    146     91    111     66     24     77     19     57     12     10
    195    185    189      2      6    117    195    220     63     79    195    106     99     70      0    202      9     22     24    126     44    219    195     13     41     35    106    207    106    158    216    162    182      6     90      7     56     14     58     81
     12     18     13    204    196     84      6     18    142    122      8    100    103    131    202      0    211    180    178     77    158     22      6    206    160    166     95      5     95     44     19     39     19    197    112    209    146    189    144    121
    205    195    198      7     15    127    205    229     72     89    205    115    109     80      9    211      0     32     33    136     53    229    205     14     51     45    116    217    116    168    226    172    192     15    100      4     66     23     67     90
    173    164    167     25     16     96    174    198     40     58    173     83     77     49     22    180     32      0     10    104     24    197    173     26     21     13     85    185     84    136    194    140    160     20     68     28     34     13     37     60
    171    162    165     26     20     93    172    196     42     56    171     83     77     46     24    178     33     10      0    103     20    196    171     33     17     15     83    183     82    135    193    138    158     19     67     31     35     10     34     57
     69     60     64    128    120     17     71     95     64     48     70     22     26     57    126     77    136    104    103      0     83     93     71    129     85     90     20     82     23     32     90     39     58    122     36    133     69    114     69     47
    151    142    145     46     39     73    151    176     25     35    151     64     57     26     44    158     53     24     20     83      0    176    151     50      2     12     63    163     62    114    172    118    138     39     47     51     17     31     14     37
     24     34     32    222    214    102     26     14    158    140     25    115    120    149    219     22    229    197    196     93    176      0     28    223    178    184    112     17    113     61      3     59     40    215    129    226    163    207    162    139
     10     13      7    197    190     77      2     24    135    115      5     93     96    124    195      6    205    173    171     71    151     28      0    199    154    160     88     12     89     38     25     33     13    190    106    202    139    182    137    114
    199    189    193     14     12    122    200    224     65     84    199    108    103     76     13    206     14     26     33    129     50    223    199      0     47     40    110    211    110    162    220    167    187     20     93     10     60     24     64     86
    154    144    147     43     36     76    154    178     26     38    154     66     59     29     41    160     51     21     17     85      2    178    154     47      0      9     65    166     65    117    175    121    141     36     50     48     18     28     16     39
    159    150    153     38     30     82    160    184     27     44    160     70     64     36     35    166     45     13     15     90     12    184    160     40      9      0     71    172     71    123    181    127    147     32     54     42     21     24     24     46
     88     79     82    109    101     13     89    113     46     27     88     13      8     37    106     95    116     85     83     20     63    112     88    110     65     71      0    101      5     51    109     56     76    102     17    113     50     94     49     27
     14     23     18    209    202     90     11     12    147    127     12    105    108    137    207      5    217    185    183     82    163     17     12    211    166    172    101      0    101     49     15     45     25    203    118    214    151    194    149    126
     89     79     82    108    101     11     89    113     47     26     89     19     12     35    106     95    116     84     82     23     62    113     89    110     65     71      5    101      0     52    110     56     76    101     19    113     50     93     48     25
     36     27     31    160    153     42     38     62     97     79     37     55     59     88    158     44    168    136    135     32    114     61     38    162    117    123     51     49     52      0     58     12     26    154     68    165    102    145    100     78
     21     31     29    218    211     99     23     13    155    137     22    112    117    146    216     19    226    194    193     90    172      3     25    220    175    181    109     15    110     58      0     56     37    212    126    223    160    203    158    136
     34     25     27    164    157     44     33     57    103     82     33     62     64     91    162     39    172    140    138     39    118     59     33    167    121    127     56     45     56     12     56      0     20    157     73    169    106    149    104     81
     17     11      8    184    177     64     14     37    122    102     14     81     84    111    182     19    192    160    158     58    138     40     13    187    141    147     76     25     76     26     37     20      0    177     93    189    126    169    124    101
    191    181    184      7      9    113    191    215     60     75    191    102     96     66      6    197     15     20     19    122     39    215    190     20     36     32    102    203    101    154    212    157    177      0     86     14     53      8     53     76
    105     95     99     92     84     30    106    130     29     15    105     16      9     24     90    112    100     68     67     36     47    129    106     93     50     54     17    118     19     68    126     73     93     86      0     97     33     78     34     16
    202    192    196      6     12    124    202    227     69     86    202    112    106     77      7    209      4     28     31    133     51    226    202     10     48     42    113    214    113    165    223    169    189     14     97      0     63     21     65     88
    139    129    133     59     51     62    139    164      8     25    139     49     43     19     56    146     66     34     35     69     17    163    139     60     18     21     50    151     50    102    160    106    126     53     33     63      0     45     12     28
    182    173    176     15     12    104    182    207     52     66    182     94     87     57     14    189     23     13     10    114     31    207    182     24     28     24     94    194     93    145    203    149    169      8     78     21     45      0     45     68
    137    128    131     60     53     59    137    162     19     21    137     51     43     12     58    144     67     37     34     69     14    162    137     64     16     24     49    149     48    100    158    104    124     53     34     65     12     45      0     23
    114    105    108     83     76     36    114    139     27      3    114     32     23     10     81    121     90     60     57     47     37    139    114     86     39     46     27    126     25     78    136     81    101     76     16     88     28     68     23      0