# bench EOLE photo, generated by bep version 0.1, generation model "A"
bEpInstance_A_20_78
     20     78    100   1000     30     60     50    250    100    4.0
      1     43    696     48    596    796    239
      2     83    194     33     94    294    246
      3     29    567     51    467    667     67
      4     25    990     54    890   1090    110
      5     61     53     30    -47    153    162
      6     57    161     37     61    261    122
      7     33    795     53    695    895    181
      8     61    858     59    758    958     58
      9     55    517     60    417    617    126
     10     71    109     41      9    209     50
     11     68     53     32    -47    153    237
     12      4    884     37    784    984    181
     13     94    243     36    143    343    152
     14     40    451     57    351    551    197
     15     24    632     41    532    732    221
     16     49    322     57    222    422     58
     17     84    877     43    777    977    160
     18     99    779     47    679    879    182
     19     84    642     48    542    742    225
     20     53    826     46    726    926    142
      0    125     32     73    160    133     24     40     44    146    160     48    113     61     16     93     46     25     16     32
    125      0     94    199     35     10    150    166     81     21     35    173     12     65    110     33    170    146    112    158
     32     94      0    105    128    101     57     73     14    114    128     79     82     29     16     61     78     55     23     65
     73    199    105      0    234    207     48     34    118    220    234     27    187    134     89    167     31     55     88     41
    160     35    128    234      0     27    185    201    116     14      1    208     48     99    145     67    206    181    147    193
    133     10    101    207     27      0    158    174     89     13     27    181     22     72    118     40    179    154    120    166
     24    150     57     48    185    158      0     17     69    171    185     23    138     86     40    118     24     16     40      9
     40    166     73     34    201    174     17      0     85    187    201     15    153    101     57    134      7     21     54      8
     44     81     14    118    116     89     69     85      0    102    116     92     69     16     29     48     90     66     32     77
    146     21    114    220     14     13    171    187    102      0     14    194     33     85    131     53    192    167    133    179
    160     35    128    234      1     27    185    201    116     14      0    208     47     99    145     67    206    181    147    193
     48    173     79     27    208    181     23     15     92    194    208      0    161    108     63    140     20     35     63     18
    113     12     82    187     48     22    138    153     69     33     47    161      0     53     98     22    158    134     99    146
     61     65     29    134     99     72     86    101     16     85     99    108     53      0     45     32    107     83     49     93
     16    110     16     89    145    118     40     57     29    131    145     63     98     45      0     77     63     41     15     49
     93     33     61    167     67     40    118    134     48     53     67    140     22     32     77      0    139    114     80    126
     46    170     78     31    206    179     24      7     90    192    206     20    158    107     63    139      0     24     58     14
     25    146     55     55    181    154     16     21     66    167    181     35    134     83     41    114     24      0     34     16
     16    112     23     88    147    120     40     54     32    133    147     63     99     49     15     80     58     34      0     46
     32    158     65     41    193    166      9      8     77    179    193     18    146     93     49    126     14     16     46      0