# bench EOLE photo, generated by bep version 0.1, generation model "A"
bEpInstance_A_35_33
     35     33    100   1000     30     60     50    250    100    4.0
      1     31    613     44    513    713    158
      2     30    263     57    163    363    192
      3      5    262     38    162    362    112
      4     20    170     51     70    270     74
      5     95    173     40     73    273    107
      6     33    480     49    380    580    186
      7      0    741     40    641    841    224
      8     46    762     52    662    862    204
      9     37    196     39     96    296    185
     10     46    199     41     99    299    153
     11     46    664     55    564    764    184
     12     84    505     54    405    605    207
     13     68    116     32     16    216     52
     14     60    697     51    597    797    171
     15     44     33     44    -67    133    230
     16     80    200     50    100    300     83
     17     40    983     56    883   1083    222
     18     18    226     41    126    326    179
     19     89    191     39     91    291    195
     20     70    102     45      2    202    125
     21     22    573     41    473    673    214
     22     27     76     42    -24    176    192
     23     11    890     48    790    990    231
     24      9    279     32    179    379    147
     25     26    917     40    817   1017    139
     26     14    714     32    614    814     56
     27     91    399     53    299    499    170
     28     50    262     60    162    362    194
     29     84    363     46    263    463     71
     30     44    956     55    856   1056    160
     31     85    422     44    322    522    238
     32     70    528     43    428    628    243
     33     44    767     42    667    867    167
     34     48    494     49    394    594    127
     35     90    377     60    277    477    129
      0     87     87    110    111     33     32     37    104    103     13     30    124     22    145    103     92     96    106    128     10    134     69     83     76     25     55     87     63     85     49     23     38     30     60
     87      0      6     23     27     54    119    124     16     16    100     61     37    108     57     20    180      9     23     41     77     46    156      6    163    112     37      5     28    173     42     67    126     57     32
     87      6      0     23     31     54    119    125     18     18    101     63     39    109     58     24    180      9     27     43     77     46    157      4    163    113     40     11     32    173     44     68    126     58     35
    110     23     23      0     18     77    142    148      7      9    123     85     18    132     34     16    203     14     18     21    100     23    180     27    186    136     59     24     50    196     65     90    149     81     54
    111     27     31     18      0     78    143    147     15     13    123     83     15    131     37      7    202     23      4     18    101     29    180     34    186    136     56     24     47    196     62     88    149     81     51
     33     54     54     77     78      0     65     70     71     70     46     14     91     54    111     70    125     63     73     94     23    101    102     50    109     58     24     54     31    119     19     15     71      5     29
     32    119    119    142    143     65      0     12    136    135     22     62    157     18    177    136     61    128    139    160     42    166     37    115     44      7     88    120     96     54     82     56     12     62     93
     37    124    125    148    147     70     12      0    141    140     24     64    161     16    182    140     55    134    143    165     47    171     33    121     39     14     91    125    100     48     85     58      1     67     96
    104     16     18      7     15     71    136    141      0      2    117     78     21    125     40     10    196      8     13     24     94     30    173     21    180    129     52     16     43    190     57     83    142     74     47
    103     16     18      9     13     70    135    140      2      0    116     77     21    124     41      8    196      9     10     24     93     31    172     22    179    128     51     15     42    189     56     82    142     73     45
     13    100    101    123    123     46     22     24    117    116      0     40    137      8    157    116     79    109    118    140     23    147     57     96     63     14     67    100     75     73     61     34     25     42     72
     30     61     63     85     83     14     62     64     78     77     40      0     97     48    118     76    120     71     78    100     23    108     97     59    104     55     26     61     35    113     20      6     66      9     32
    124     37     39     18     15     91    157    161     21     21    137     97      0    145     21     21    216     30     19      3    114     14    194     43    200    150     70     36     61    210     76    103    162     94     65
     22    108    109    132    131     54     18     16    125    124      8     48    145      0    166    124     71    118    126    148     32    155     49    105     55     12     74    108     83     64     69     42     17     50     80
    145     57     58     34     37    111    177    182     40     41    157    118     21    166      0     42    237     48     41     18    135     11    214     62    221    170     92     57     83    230     97    123    183    115     86
    103     20     24     16      7     70    136    140     10      8    116     76     21    124     42      0    196     16      3     24     94     33    173     26    179    129     49     17     40    189     55     82    142     73     44
     92    180    180    203    202    125     61     55    196    196     79    120    216     71    237    196      0    189    198    220    102    226     24    176     16     67    146    180    155      6    140    113     54    122    152
     96      9      9     14     23     63    128    134      8      9    109     71     30    118     48     16    189      0     19     33     86     37    166     13    172    122     46     12     38    182     51     76    135     67     41
    106     23     27     18      4     73    139    143     13     10    118     78     19    126     41      3    198     19      0     22     96     32    175     29    182    132     52     20     43    191     57     84    144     76     46
    128     41     43     21     18     94    160    165     24     24    140    100      3    148     18     24    220     33     22      0    118     12    197     46    204    153     74     40     65    213     80    106    166     98     68
     10     77     77    100    101     23     42     47     94     93     23     23    114     32    135     94    102     86     96    118      0    124     79     73     86     35     46     78     54     95     40     16     48     20     51
    134     46     46     23     29    101    166    171     30     31    147    108     14    155     11     33    226     37     32     12    124      0    203     50    210    159     82     46     73    220     87    113    172    104     76
     69    156    157    180    180    102     37     33    173    172     57     97    194     49    214    173     24    166    175    197     79    203      0    152      7     44    124    157    133     18    118     91     31     99    129
     83      6      4     27     34     50    115    121     21     22     96     59     43    105     62     26    176     13     29     46     73     50    152      0    159    108     36     11     28    169     40     64    122     54     31
     76    163    163    186    186    109     44     39    180    179     63    104    200     55    221    179     16    172    182    204     86    210      7    159      0     50    130    163    139     10    124     97     37    105    135
     25    112    113    136    136     58      7     14    129    128     14     55    150     12    170    129     67    122    132    153     35    159     44    108     50      0     81    113     89     60     75     48     15     55     86
     55     37     40     59     56     24     88     91     52     51     67     26     70     74     92     49    146     46     52     74     46     82    124     36    130     81      0     35      9    139      5     32     92     26      5
     87      5     11     24     24     54    120    125     16     15    100     61     36    108     57     17    180     12     20     40     78     46    157     11    163    113     35      0     26    173     40     66    126     58     30
     63     28     32     50     47     31     96    100     43     42     75     35     61     83     83     40    155     38     43     65     54     73    133     28    139     89      9     26      0    148     14     41    101     33      3
     85    173    173    196    196    119     54     48    190    189     73    113    210     64    230    189      6    182    191    213     95    220     18    169     10     60    139    173    148      0    133    107     47    115    145
     49     42     44     65     62     19     82     85     57     56     61     20     76     69     97     55    140     51     57     80     40     87    118     40    124     75      5     40     14    133      0     26     86     20     11
     23     67     68     90     88     15     56     58     83     82     34      6    103     42    123     82    113     76     84    106     16    113     91     64     97     48     32     66     41    107     26      0     60     10     38
     38    126    126    149    149     71     12      1    142    142     25     66    162     17    183    142     54    135    144    166     48    172     31    122     37     15     92    126    101     47     86     60      0     68     98
     30     57     58     81     81      5     62     67     74     73     42      9     94     50    115     73    122     67     76     98     20    104     99     54    105     55     26     58     33    115     20     10     68      0     31
     60     32     35     54     51     29     93     96     47     45     72     32     65     80     86     44    152     41     46     68     51     76    129     31    135     86      5     30      3    145     11     38     98     31      0