# bench EOLE photo, generated by bep version 0.1, generation model "A"
bEpInstance_A_40_75
     40     75    100   1000     30     60     50    250    100    4.0
      1     36    458     35    358    558    146
      2      2    530     46    430    630    169
      3     37    313     50    213    413     69
      4      5    338     39    238    438    134
      5      6    259     58    159    359    165
      6     86    247     34    147    347     99
      7     64    864     49    764    964     62
      8     84    918     48    818   1018     89
      9     37    756     51    656    856    130
     10     28    224     60    124    324    182
     11     54    668     53    568    768    168
     12      0     77     30    -23    177     64
     13     33    942     50    842   1042     88
     14     19    791     43    691    891    216
     15     66     71     57    -29    171    149
     16     99    474     51    374    574    123
     17     23    368     53    268    468    153
     18     59    762     35    662    862     75
     19     43    935     52    835   1035    137
     20      1    730     45    630    830    120
     21     67    159     46     59    259    222
     22     95    981     51    881   1081    171
     23      5    578     32    478    678     58
     24      5    786     42    686    886    106
     25     15    172     54     72    272    199
     26     94    975     57    875   1075    122
     27     91    593     54    493    693    235
     28     32    306     38    206    406    249
     29     46    811     56    711    911    133
     30     79    542     30    442    642    219
     31     12    115     57     15    215     84
     32     91    292     44    192    392     60
     33     46    253     54    153    353    130
     34     22    673     53    573    773     77
     35     26    559     31    459    659    168
     36     87    327     48    227    427    116
     37     13    437     53    337    537    236
     38     98    764     53    664    864     69
     39     88    657     38    557    757    206
     40     95    728     55    628    828    133
      0     19     36     30     50     54    101    115     74     58     52     95    121     83     97     16     22     76    119     68     75    131     30     82     71    130     36     38     88     23     85     43     51     53     25     35      7     78     51     69
     19      0     54     48     67     73     84     99     57     76     36    113    103     65    115     28     40     59    101     50     94    115     12     64     89    113     27     56     71     19    103     63     70     36      9     55     23     63     38     54
     36     54      0     10     15     20    137    151    110     22     88     59    157    119     60     43     14    112    155    104     39    167     66    118     35    166     71      2    124     58     49     14     15     90     61     12     31    113     86    104
     30     48     10      0     19     30    132    146    104     29     83     65    151    113     68     41      8    106    149     98     47    162     60    112     41    160     67     10    118     54     55     24     23     83     55     20     24    109     82    100
     50     67     15     19      0     20    151    165    124     10    102     45    170    133     49     58     27    126    169    117     29    181     79    131     21    180     86     13    138     73     36     22     10    103     75     26     44    128    101    119
     54     73     20     30     20      0    154    167    127     15    105     47    174    137     44     56     34    128    172    122     22    183     85    136     25    182     86     19    141     73     37     11     10    107     79     20     50    129    102    120
    101     84    137    132    151    154      0     14     27    160     49    197     20     21    198     97    124     25     18     37    176     30     73     24    173     28     68    139     13     80    187    143    152     48     76    134    107     26     52     34
    115     99    151    146    165    167     14      0     42    174     62    211     14     35    211    111    138     39     11     51    189     15     87     38    187     14     81    153     28     94    201    156    166     63     90    147    121     38     65     47
     74     57    110    104    124    127     27     42      0    133     22    170     46      9    171     72     97      5     44     11    149     58     45     10    146     56     42    112     13     54    160    116    125     21     49    107     79     15     27     16
     58     76     22     29     10     15    160    174    133      0    111     37    179    141     39     64     36    134    177    126     18    189     88    140     13    188     93     20    146     80     27     23      8    112     83     29     53    136    109    127
     52     36     88     83    102    105     49     62     22    111      0    148     68     31    149     49     75     23     66     20    127     78     25     31    124     77     20     90     35     32    138     94    103      8     28     85     58     26      8     18
     95    113     59     65     45     47    197    211    170     37    148      0    216    178     16    102     72    171    214    163     26    227    125    177     24    225    130     57    183    117      9     58     45    149    120     66     90    173    146    164
    121    103    157    151    170    174     20     14     46    179     68    216      0     37    217    118    143     45      3     53    195     18     91     39    192     17     88    159     32    100    206    163    172     67     95    154    126     47     72     55
     83     65    119    113    133    137     21     35      9    141     31    178     37      0    180     81    105     12     36     15    158     51     53      3    154     49     52    121      8     64    169    126    134     29     58    117     88     20     37     24
     97    115     60     68     49     44    198    211    171     39    149     16    217    180      0    101     75    172    216    165     22    227    127    179     28    226    130     59    185    117     17     55     45    150    122     64     92    173    146    164
     16     28     43     41     58     56     97    111     72     64     49    102    118     81    101      0     32     72    116     68     79    126     35     81     78    125     29     45     85     17     92     45     56     53     28     36     23     72     45     63
     22     40     14      8     27     34    124    138     97     36     75     72    143    105     75     32      0     98    141     90     53    154     52    104     49    152     58     15    110     45     63     25     29     76     47     19     17    100     74     91
     76     59    112    106    126    128     25     39      5    134     23    171     45     12    172     72     98      0     43     16    150     55     47     14    147     53     43    114     12     55    162    117    127     24     51    108     82      9     27     12
    119    101    155    149    169    172     18     11     44    177     66    214      3     36    216    116    141     43      0     52    194     17     89     38    190     16     86    157     31     98    205    161    170     65     94    152    124     44     70     53
     68     50    104     98    117    122     37     51     11    126     20    163     53     15    165     68     90     16     52      0    143     67     38     14    139     65     40    106     23     50    153    111    119     15     43    103     73     25     28     23
     75     94     39     47     29     22    176    189    149     18    127     26    195    158     22     79     53    150    194    143      0    205    105    157     13    204    108     37    163     95     17     33     24    128    100     42     70    151    124    142
    131    115    167    162    181    183     30     15     58    189     78    227     18     51    227    126    154     55     17     67    205      0    103     53    203      1     97    169     44    109    217    172    182     79    106    163    137     54     81     63
     30     12     66     60     79     85     73     87     45     88     25    125     91     53    127     35     52     47     89     38    105    103      0     52    101    101     21     68     59     20    115     74     81     24      7     66     35     51     28     43
     82     64    118    112    131    136     24     38     10    140     31    177     39      3    179     81    104     14     38     14    157     53     52      0    153     52     52    120     12     63    167    125    133     28     56    116     87     23     38     26
     71     89     35     41     21     25    173    187    146     13    124     24    192    154     28     78     49    147    190    139     13    203    101    153      0    201    106     33    159     93     14     35     21    125     96     42     66    149    122    140
    130    113    166    160    180    182     28     14     56    188     77    225     17     49    226    125    152     53     16     65    204      1    101     52    201      0     95    167     42    108    215    170    180     77    105    162    136     52     79     61
     36     27     71     67     86     86     68     81     42     93     20    130     88     52    130     29     58     43     86     40    108     97     21     52    106     95      0     73     55     13    121     75     85     26     18     66     43     42     16     33
     38     56      2     10     13     19    139    153    112     20     90     57    159    121     59     45     15    114    157    106     37    169     68    120     33    167     73      0    126     60     48     15     13     91     63     14     33    115     88    106
     88     71    124    118    138    141     13     28     13    146     35    183     32      8    185     85    110     12     31     23    163     44     59     12    159     42     55    126      0     67    174    130    139     35     63    121     93     17     39     24
     23     19     58     54     73     73     80     94     54     80     32    117    100     64    117     17     45     55     98     50     95    109     20     63     93    108     13     60     67      0    108     62     72     35     13     53     31     55     28     46
     85    103     49     55     36     37    187    201    160     27    138      9    206    169     17     92     63    162    205    153     17    217    115    167     14    215    121     48    174    108      0     48     35    139    111     56     80    163    136    154
     43     63     14     24     22     11    143    156    116     23     94     58    163    126     55     45     25    117    161    111     33    172     74    125     35    170     75     15    130     62     48      0     14     96     68      8     41    118     91    109
     51     70     15     23     10     10    152    166    125      8    103     45    172    134     45     56     29    127    170    119     24    182     81    133     21    180     85     13    139     72     35     14      0    105     76     21     46    128    101    119
     53     36     90     83    103    107     48     63     21    112      8    149     67     29    150     53     76     24     65     15    128     79     24     28    125     77     26     91     35     35    139     96    105      0     28     88     59     29     16     22
     25      9     61     55     75     79     76     90     49     83     28    120     95     58    122     28     47     51     94     43    100    106      7     56     96    105     18     63     63     13    111     68     76     28      0     59     30     54     28     45
     35     55     12     20     26     20    134    147    107     29     85     66    154    117     64     36     19    108    152    103     42    163     66    116     42    162     66     14    121     53     56      8     21     88     59      0     33    109     82    100
      7     23     31     24     44     50    107    121     79     53     58     90    126     88     92     23     17     82    124     73     70    137     35     87     66    136     43     33     93     31     80     41     46     59     30     33      0     84     58     75
     78     63    113    109    128    129     26     38     15    136     26    173     47     20    173     72    100      9     44     25    151     54     51     23    149     52     42    115     17     55    163    118    128     29     54    109     84      0     26      9
     51     38     86     82    101    102     52     65     27    109      8    146     72     37    146     45     74     27     70     28    124     81     28     38    122     79     16     88     39     28    136     91    101     16     28     82     58     26      0     17
     69     54    104    100    119    120     34     47     16    127     18    164     55     24    164     63     91     12     53     23    142     63     43     26    140     61     33    106     24     46    154    109    119     22     45    100     75      9     17      0