# bench EOLE photo, generated by bep version 0.1, generation model "A"
bEpInstance_A_30_32
     30     32    100   1000     30     60     50    250    100    4.0
      1     45    699     50    599    799    195
      2     87    543     46    443    643    233
      3     75    178     38     78    278     79
      4     30    117     35     17    217    183
      5     77    910     34    810   1010    175
      6     26    678     43    578    778    212
      7     78    260     49    160    360     85
      8     87    947     49    847   1047    113
      9     65    282     31    182    382    152
     10     83    566     43    466    666    165
     11     75    694     52    594    794     60
     12     81    914     52    814   1014    165
     13     83    849     36    749    949     66
     14     53    624     57    524    724    111
     15     89    524     44    424    624    201
     16     47     97     32     -3    197     73
     17     38    109     49      9    209     91
     18     68     52     54    -48    152    134
     19     75    499     44    399    599    162
     20     41    186     34     86    286     97
     21      3    333     39    233    433    162
     22     96    210     56    110    310    218
     23     74    347     48    247    447     91
     24     44    663     39    563    763    215
     25     77    950     30    850   1050    139
     26      0    808     56    708    908    200
     27     31    338     39    238    438    194
     28     52    440     59    340    540    162
     29     78    273     33    173    373    196
     30     48    987     47    887   1087     93
      0     40    130    145     53      7    110     62    104     34      7     54     38     18     45    150    147    161     50    128     92    122     88      9     63     29     90     64    106     72
     40      0     91    107     91     37     70    101     65      5     37     92     76     21      4    111    109    122     11     89     56     83     49     31    101     69     53     27     67    111
    130     91      0     18    183    125     20    192     26     97    129    184    167    111     86     21     19     31     80      8     42      9     42    121    193    158     41     65     23    202
    145    107     18      0    198    140     37    207     42    113    144    199    183    126    102      6      2     18     96     17     54     28     58    136    208    172     55     80     40    217
     53     91    183    198      0     59    162      9    157     86     54      1     15     71     96    203    200    214    102    181    145    175    140     62     10     31    143    117    159     20
      7     37    125    140     59      0    105     68     99     31     12     60     45     15     41    145    142    156     46    123     86    118     83      5     69     33     85     59    102     77
    110     70     20     37    162    105      0    171      6     76    108    163    147     91     66     41     39     52     59     20     26     13     21    101    172    138     22     45      3    181
     62    101    192    207      9     68    171      0    166     95     63      8     24     81    105    212    209    223    112    190    154    184    150     71      2     40    152    127    168     13
    104     65     26     42    157     99      6    166      0     71    103    158    141     85     60     46     43     57     54     24     20     19     16     95    167    132     16     39      3    176
     34      5     97    113     86     31     76     95     71      0     32     87     70     16     10    117    114    128     16     95     61     89     54     26     96     63     58     32     73    105
      7     37    129    144     54     12    108     63    103     32      0     55     38     18     42    149    146    160     48    127     92    121     86     10     64     34     89     63    105     73
     54     92    184    199      1     60    163      8    158     87     55      0     16     72     97    204    201    215    103    182    146    176    141     63      9     33    144    118    160     20
     38     76    167    183     15     45    147     24    141     70     38     16      0     56     81    188    185    199     87    166    130    159    125     47     25     23    128    102    144     35
     18     21    111    126     71     15     91     81     85     16     18     72     56      0     26    131    128    143     31    109     73    104     69     10     81     47     71     46     87     90
     45      4     86    102     96     41     66    105     60     10     42     97     81     26      0    107    104    118      7     85     52     78     44     36    106     74     48     22     62    116
    150    111     21      6    203    145     41    212     46    117    149    204    188    131    107      0      3     12    100     22     60     30     62    141    213    178     60     85     44    222
    147    109     19      2    200    142     39    209     43    114    146    201    185    128    104      3      0     16     97     19     56     29     60    138    210    175     57     82     42    219
    161    122     31     18    214    156     52    223     57    128    160    215    199    143    118     12     16      0    111     34     72     40     73    152    224    189     72     97     55    233
     50     11     80     96    102     46     59    112     54     16     48    103     87     31      7    100     97    111      0     78     45     72     38     41    112     79     41     15     56    122
    128     89      8     17    181    123     20    190     24     95    127    182    166    109     85     22     19     34     78      0     37     15     41    119    191    155     38     63     23    200
     92     56     42     54    145     86     26    154     20     61     92    146    130     73     52     60     56     72     45     37      0     38     18     83    155    118      7     29     24    163
    122     83      9     28    175    118     13    184     19     89    121    176    159    104     78     30     29     40     72     15     38      0     34    113    185    151     35     58     16    194
     88     49     42     58    140     83     21    150     16     54     86    141    125     69     44     62     60     73     38     41     18     34      0     79    150    116     10     23     18    160
      9     31    121    136     62      5    101     71     95     26     10     63     47     10     36    141    138    152     41    119     83    113     79      0     72     37     81     55     97     81
     63    101    193    208     10     69    172      2    167     96     64      9     25     81    106    213    210    224    112    191    155    185    150     72      0     40    153    127    169     11
     29     69    158    172     31     33    138     40    132     63     34     33     23     47     74    178    175    189     79    155    118    151    116     37     40      0    117     92    135     46
     90     53     41     55    143     85     22    152     16     58     89    144    128     71     48     60     57     72     41     38      7     35     10     81    153    117      0     26     20    162
     64     27     65     80    117     59     45    127     39     32     63    118    102     46     22     85     82     97     15     63     29     58     23     55    127     92     26      0     42    136
    106     67     23     40    159    102      3    168      3     73    105    160    144     87     62     44     42     55     56     23     24     16     18     97    169    135     20     42      0    178
     72    111    202    217     20     77    181     13    176    105     73     20     35     90    116    222    219    233    122    200    163    194    160     81     11     46    162    136    178      0