# bench EOLE photo, generated by bep version 0.1, generation model "A"
bEpInstance_A_20_49
     20     49    100   1000     30     60     50    250    100    4.0
      1      4    220     39    120    320     82
      2     75    295     50    195    395    236
      3     44    618     58    518    718    230
      4     63    996     46    896   1096    246
      5     85    899     42    799    999    125
      6     49    349     56    249    449    173
      7     18    407     35    307    507    150
      8     94    775     32    675    875    247
      9    100    396     34    296    496    198
     10     69    809     50    709    909     76
     11     43    594     30    494    694     60
     12     59    575     30    475    675    138
     13     47    448     55    348    548    242
     14     80    684     47    584    784    246
     15      9    764     44    664    864     56
     16     54    565     30    465    665    157
     17     97    158     38     58    258    181
     18     97    936     54    836   1036    128
     19     53    813     43    713    913     73
     20     39    477     47    377    577    222
      0     25    100    194    170     34     46    140     50    148     94     89     58    117    136     87     27    180    148     64
     25      0     81    175    151     14     31    120     26    128     75     70     38     97    118     67     34    160    129     46
    100     81      0     94     70     67     53     41     57     48      6     11     42     18     37     13    115     80     48     35
    194    175     94      0     24    161    147     55    150     46    100    105    137     78     59    107    209     17     45    129
    170    151     70     24      0    137    124     31    125     22     76     81    113     53     38     83    185      9     22    106
     34     14     67    161    137      0     16    107     17    115     61     56     24     84    104     54     49    147    116     32
     46     31     53    147    124     16      0     93     20    101     47     43     12     70     89     40     65    133    101     18
    140    120     41     55     31    107     93      0     94     10     47     50     82     23     21     53    154     40     13     75
     50     26     57    150    125     17     20     94      0    103     51     45     18     72     94     43     59    135    104     25
    148    128     48     46     22    115    101     10    103      0     54     58     90     31     18     61    162     32      4     83
     94     75      6    100     76     61     47     47     51     54      0      6     36     24     43      7    109     86     54     29
     89     70     11    105     81     56     43     50     45     58      6      0     31     27     48      2    104     90     59     25
     58     38     42    137    113     24     12     82     18     90     36     31      0     59     79     29     73    122     91      7
    117     97     18     78     53     84     70     23     72     31     24     27     59      0     26     30    131     63     32     52
    136    118     37     59     38    104     89     21     94     18     43     48     79     26      0     51    153     48     16     72
     87     67     13    107     83     54     40     53     43     61      7      2     29     30     51      0    102     93     62     22
     27     34    115    209    185     49     65    154     59    162    109    104     73    131    153    102      0    194    164     81
    180    160     80     17      9    147    133     40    135     32     86     90    122     63     48     93    194      0     32    115
    148    129     48     45     22    116    101     13    104      4     54     59     91     32     16     62    164     32      0     84
     64     46     35    129    106     32     18     75     25     83     29     25      7     52     72     22     81    115     84      0