# bench EOLE photo, generated by bep version 0.1, generation model "A"
bEpInstance_A_10_58
     10     58    100   1000     30     60     50    250    100    4.0
      1     77    938     30    838   1038     58
      2     65    781     58    681    881    166
      3     18    878     30    778    978    120
      4     23    462     44    362    562    173
      5     48    775     34    675    875    216
      6     64     83     36    -17    183    241
      7     75    221     32    121    321    100
      8     27    597     33    497    697     57
      9     53    157     32     57    257     86
     10     94    994     53    894   1094     75
      0     39     21    119     41    213    179     86    195     14
     39      0     26     80      4    174    140     46    156     53
     21     26      0    104     26    199    164     70    180     34
    119     80    104      0     78     95     61     33     76    134
     41      4     26     78      0    173    138     44    154     55
    213    174    199     95    173      0     34    128     18    227
    179    140    164     61    138     34      0     94     16    193
     86     46     70     33     44    128     94      0    110    100
    195    156    180     76    154     18     16    110      0    209
     14     53     34    134     55    227    193    100    209      0