# bench EOLE photo, generated by bep version 0.1, generation model "A"
bEpInstance_A_45_55
     45     55    100   1000     30     60     50    250    100    4.0
      1     19    200     49    100    300    167
      2     85    121     40     21    221     90
      3     78    127     45     27    227    124
      4      3    310     45    210    410    198
      5     95    488     32    388    588    220
      6     93    679     32    579    779    219
      7     57    792     44    692    892     85
      8     51    667     54    567    767    190
      9     87    417     38    317    517    194
     10     54    616     58    516    716    112
     11     75    406     51    306    506    206
     12     72    183     46     83    283    182
     13     67    599     45    499    699    169
     14     28    606     43    506    706    219
     15     40    900     30    800   1000    231
     16     57    812     48    712    912    137
     17     23    886     34    786    986    204
     18     50     67     32    -33    167     99
     19     47    764     30    664    864     88
     20     95    544     56    444    644    174
     21     14    362     36    262    462    134
     22     97    655     38    555    755    123
     23     56    284     38    184    384     74
     24      9    871     47    771    971    115
     25     76    706     32    606    806    101
     26     78    172     45     72    272     99
     27     94    526     43    426    626    227
     28      7    287     45    187    387     92
     29     65    716     49    616    816    174
     30     37    898     60    798    998    236
     31     18    253     31    153    353    105
     32     12    602     48    502    702    226
     33     31    695     34    595    795     66
     34     87    638     40    538    738    211
     35     16    764     51    664    864     96
     36      5    189     43     89    289    190
     37     91     79     39    -21    179    105
     38     98    302     36    202    402     81
     39     56    250     43    150    350    186
     40     86     38     47    -62    138     82
     41     73    695     37    595    795    170
     42     33    569     42    469    669    149
     43     33     90     52    -10    190    127
     44     28    175     32     75    275     87
     45     25    403     44    303    503     96
      0     25     23     27     74    121    148    117     56    104     53     13    100    101    175    153    171     34    141     88     40    115     22    167    127     16     83     21    129    174     13    100    123    110    141      4     35     32     15     43    124     92     27      6     50
     25      0      2     51     91    139    167    136     74    123     71     15    119    122    195    172    191     16    161    105     62    133     41    188    146     12    101     45    148    194     37    121    144    129    161     26     10     45     33     20    143    112     15     19     72
     23      2      0     49     90    138    166    135     72    122     69     14    118    120    193    171    190     16    159    104     60    132     39    186    144     11     99     43    147    193     34    119    142    127    160     23     12     44     31     22    142    111     14     17     70
     27     51     49      0     50     94    121     90     34     77     30     36     74     74    147    126    144     61    114     62     13     89     14    140    100     39     58      5    102    147     14     73     96     84    113     30     61     23     20     71     97     65     55     34     23
     74     91     90     50      0     47     76     46     17     33     21     76     28     33    103     81    101    105     70     14     37     41     51     98     54     79      9     54     57    103     61     35     54     37     71     78    102     46     60    112     52     25    100     80     27
    121    139    138     94     47      0     29     10     65     18     68    124     21     24     56     34     54    153     24     33     81      6     99     52      7    126     38    100     11     56    108     27     16     10     28    124    150     94    107    160      6     31    148    127     71
    148    167    166    121     76     29      0     31     94     44     96    152     48     47     27      5     24    181      7     62    108     35    127     23     22    155     67    126     19     26    135     48     25     39     12    151    178    122    135    188     24     56    175    154     97
    117    136    135     90     46     10     31      0     63     12     65    121     17     16     58     36     55    150     24     32     76     11     95     52     11    123     36     95     12     57    103     18      8     11     25    120    147     92    104    157      8     24    144    123     66
     56     74     72     34     17     65     94     63      0     50      4     58     45     49    121     99    118     87     87     31     22     59     34    115     72     61     27     38     74    120     44     49     70     55     88     60     84     28     42     94     69     40     82     62     15
    104    123    122     77     33     18     44     12     50      0     52    108      5      6     71     49     67    137     37     20     64     14     83     64     23    111     24     83     25     70     91     11     20      9     38    107    134     79     91    144     20     12    131    110     53
     53     71     69     30     21     68     96     65      4     52      0     55     48     51    123    101    120     84     89     34     18     62     30    117     75     58     30     34     77    123     40     51     73     58     90     57     81     26     39     92     72     42     79     58     12
     13     15     14     36     76    124    152    121     58    108     55      0    104    106    179    157    176     29    145     90     47    118     25    172    130      3     85     30    133    178     22    105    128    113    145     16     26     30     17     36    128     96     25     11     56
    100    119    118     74     28     21     48     17     45      5     48    104      0      9     75     53     72    133     41     15     60     15     78     69     26    106     19     79     29     75     87     13     25     10     43    103    130     74     87    140     24     11    127    106     50
    101    122    120     74     33     24     47     16     49      6     51    106      9      0     73     52     70    134     39     22     61     21     80     66     27    109     25     79     29     73     88      4     22     16     39    104    132     77     89    142     24      9    129    107     50
    175    195    193    147    103     56     27     58    121     71    123    179     75     73      0     22      5    208     34     90    134     62    154     10     49    182     94    153     46      0    161     74     51     66     34    177    205    150    162    215     51     82    202    181    124
    153    172    171    126     81     34      5     36     99     49    101    157     53     52     22      0     20    186     12     67    113     40    132     19     26    160     72    131     24     22    140     53     29     44     15    156    183    127    140    193     29     61    180    159    102
    171    191    190    144    101     54     24     55    118     67    120    176     72     70      5     20      0    204     31     87    131     60    150      5     46    179     91    149     43      4    158     71     47     64     30    174    202    147    159    212     49     79    199    177    120
     34     16     16     61    105    153    181    150     87    137     84     29    133    134    208    186    204      0    174    119     74    147     54    201    159     27    115     56    162    207     47    134    157    143    174     32     10     59     45     11    157    125      7     27     84
    141    161    159    114     70     24      7     24     87     37     89    145     41     39     34     12     31    174      0     56    100     29    120     28     16    148     60    119     12     33    127     41     17     33      7    144    171    116    128    181     18     48    168    147     90
     88    105    104     62     14     33     62     32     31     20     34     90     15     22     90     67     87    119     56      0     49     27     65     84     40     93      4     67     43     89     75     25     41     23     58     91    116     60     74    126     38     16    114     93     39
     40     62     60     13     37     81    108     76     22     64     18     47     60     61    134    113    131     74    100     49      0     76     22    127     87     50     45     18     89    134     27     60     83     71    100     43     73     25     29     82     84     51     68     46     10
    115    133    132     89     41      6     35     11     59     14     62    118     15     21     62     40     60    147     29     27     76      0     93     58     13    120     32     94     17     62    102     25     19      4     33    118    144     88    101    154     11     26    142    121     65
     22     41     39     14     51     99    127     95     34     83     30     25     78     80    154    132    150     54    120     65     22     93      0    147    105     28     61     12    108    153     12     80    102     88    120     26     51     11      8     61    102     71     48     28     30
    167    188    186    140     98     52     23     52    115     64    117    172     69     66     10     19      5    201     28     84    127     58    147      0     44    175     88    146     41      9    154     67     44     61     26    170    199    143    155    209     46     75    195    174    117
    127    146    144    100     54      7     22     11     72     23     75    130     26     27     49     26     46    159     16     40     87     13    105     44      0    133     45    106      3     48    114     30     11     17     20    130    156    101    114    167      2     35    154    133     76
     16     12     11     39     79    126    155    123     61    111     58      3    106    109    182    160    179     27    148     93     50    120     28    175    133      0     88     33    136    181     25    108    131    116    148     18     23     32     20     33    130     99     23     12     59
     83    101     99     58      9     38     67     36     27     24     30     85     19     25     94     72     91    115     60      4     45     32     61     88     45     88      0     63     48     94     70     27     45     28     62     87    111     56     69    122     42     18    110     89     35
     21     45     43      5     54    100    126     95     38     83     34     30     79     79    153    131    149     56    119     67     18     94     12    146    106     33     63      0    108    152      8     78    102     90    119     24     56     23     15     65    103     70     49     28     29
    129    148    147    102     57     11     19     12     74     25     77    133     29     29     46     24     43    162     12     43     89     17    108     41      3    136     48    108      0     46    116     31      9     20     17    132    159    103    116    169      5     37    156    135     78
    174    194    193    147    103     56     26     57    120     70    123    178     75     73      0     22      4    207     33     89    134     62    153      9     48    181     94    152     46      0    161     74     50     66     33    177    205    149    162    215     51     82    202    180    123
     13     37     34     14     61    108    135    103     44     91     40     22     87     88    161    140    158     47    127     75     27    102     12    154    114     25     70      8    116    161      0     87    110     97    127     16     47     23      9     56    111     79     40     19     37
    100    121    119     73     35     27     48     18     49     11     51    105     13      4     74     53     71    134     41     25     60     25     80     67     30    108     27     78     31     74     87      0     23     20     40    103    132     78     88    142     27      9    128    106     49
    123    144    142     96     54     16     25      8     70     20     73    128     25     22     51     29     47    157     17     41     83     19    102     44     11    131     45    102      9     50    110     23      0     19     17    126    154     99    111    164     10     31    151    130     73
    110    129    127     84     37     10     39     11     55      9     58    113     10     16     66     44     64    143     33     23     71      4     88     61     17    116     28     90     20     66     97     20     19      0     36    114    139     84     97    150     14     21    137    116     60
    141    161    160    113     71     28     12     25     88     38     90    145     43     39     34     15     30    174      7     58    100     33    120     26     20    148     62    119     17     33    127     40     17     36      0    143    172    117    128    182     22     48    168    147     90
      4     26     23     30     78    124    151    120     60    107     57     16    103    104    177    156    174     32    144     91     43    118     26    170    130     18     87     24    132    177     16    103    126    114    143      0     34     36     19     42    127     95     25      6     53
     35     10     12     61    102    150    178    147     84    134     81     26    130    132    205    183    202     10    171    116     73    144     51    199    156     23    111     56    159    205     47    132    154    139    172     34      0     55     43     10    154    123     14     28     82
     32     45     44     23     46     94    122     92     28     79     26     30     74     77    150    127    147     59    116     60     25     88     11    143    101     32     56     23    103    149     23     78     99     84    117     36     55      0     16     66     98     68     55     36     31
     15     33     31     20     60    107    135    104     42     91     39     17     87     89    162    140    159     45    128     74     29    101      8    155    114     20     69     15    116    162      9     88    111     97    128     19     43     16      0     53    111     79     40     20     39
     43     20     22     71    112    160    188    157     94    144     92     36    140    142    215    193    212     11    181    126     82    154     61    209    167     33    122     65    169    215     56    142    164    150    182     42     10     66     53      0    164    133     18     37     92
    124    143    142     97     52      6     24      8     69     20     72    128     24     24     51     29     49    157     18     38     84     11    102     46      2    130     42    103      5     51    111     27     10     14     22    127    154     98    111    164      0     33    151    130     73
     92    112    111     65     25     31     56     24     40     12     42     96     11      9     82     61     79    125     48     16     51     26     71     75     35     99     18     70     37     82     79      9     31     21     48     95    123     68     79    133     33      0    119     98     41
     27     15     14     55    100    148    175    144     82    131     79     25    127    129    202    180    199      7    168    114     68    142     48    195    154     23    110     49    156    202     40    128    151    137    168     25     14     55     40     18    151    119      0     21     78
      6     19     17     34     80    127    154    123     62    110     58     11    106    107    181    159    177     27    147     93     46    121     28    174    133     12     89     28    135    180     19    106    130    116    147      6     28     36     20     37    130     98     21      0     57
     50     72     70     23     27     71     97     66     15     53     12     56     50     50    124    102    120     84     90     39     10     65     30    117     76     59     35     29     78    123     37     49     73     60     90     53     82     31     39     92     73     41     78     57      0