# bench EOLE photo, generated by bep version 0.1, generation model "A"
bEpInstance_A_30_56
     30     56    100   1000     30     60     50    250    100    4.0
      1      5    112     43     12    212    131
      2     28    342     51    242    442    149
      3     58    713     60    613    813     56
      4     94    860     45    760    960     90
      5     63    250     54    150    350    152
      6     49    985     39    885   1085     92
      7     80    268     35    168    368    125
      8     60    476     42    376    576    180
      9     59    838     31    738    938    224
     10     18    746     41    646    846    202
     11     46    360     54    260    460    129
     12     22    281     48    181    381    219
     13     53    372     40    272    472     55
     14     35    648     37    548    748     80
     15     92    404     46    304    504    152
     16     88    937     34    837   1037    143
     17     78    211     40    111    311    241
     18     96    700     52    600    800    133
     19      6    504     55    404    604    106
     20     79    410     33    310    510    113
     21     79    476     40    376    576     77
     22     12    582     39    482    682     58
     23     99    819     47    719    919    223
     24     76    711     40    611    811    156
     25     93    669     44    569    769    226
     26     37    195     39     95    295    136
     27     70    108     51      8    208    147
     28     52    830     54    730    930    110
     29     30    143     43     43    243    136
     30     73    731     44    631    831    192
      0     57    150    188     37    218     43     92    182    158     62     42     66    134     76    207     30    148     98     76     92    117    178    150    140     22     16    179      9    155
     57      0     93    130     24    160     22     34    124    101      6     15      9     76     22    149     35     91     40     21     35     60    120     93     83     36     59    122     49     97
    150     93      0     37    115     68    111     59     31     12     88    108     85     17     77     56    125     10     53     75     59     34     28      4     14    129    151     29    142      5
    188    130     37      0    152     33    148     96     10     34    125    145    122     55    114     19    162     40     91    112     96     72     10     37     47    166    188     12    179     32
     37     24    115    152      0    183      6     56    147    124     27     12     30     99     39    171     10    112     65     40     56     83    142    115    105     15     35    145     27    120
    218    160     68     33    183      0    179    127     36     60    156    176    153     84    145     15    193     72    120    143    127    101     43     68     79    197    219     38    210     63
     43     22    111    148      6    179      0     52    142    120     24     14     26     95     34    167     14    108     61     35     52     80    137    110    100     21     40    140     33    115
     92     34     59     96     56    127     52      0     90     68     29     49     26     43     19    115     66     56     15     17      4     29     86     58     48     70     92     88     83     63
    182    124     31     10    147     36    142     90      0     25    119    139    116     47    108     25    156     35     84    107     90     65     11     32     43    160    182      2    173     26
    158    101     12     34    124     60    120     68     25      0     96    116     93     24     87     50    134     22     60     85     69     41     27     16     26    137    160     22    150     14
     62      6     88    125     27    156     24     29    119     96      0     20      3     72     15    144     38     85     37     14     30     56    115     88     78     41     63    117     54     92
     42     15    108    145     12    176     14     49    139    116     20      0     24     91     35    164     22    106     55     35     50     75    135    108     98     21     44    137     34    113
     66      9     85    122     30    153     26     26    116     93      3     24      0     69     12    141     40     82     35     11     26     53    112     84     74     44     66    114     57     89
    134     76     17     55     99     84     95     43     47     24     72     91     69      0     62     73    109     20     36     60     44     17     45     18     15    113    135     45    126     22
     76     22     77    114     39    145     34     19    108     87     15     35     12     62      0    133     48     74     32      3     18     48    103     76     66     54     74    106     67     81
    207    149     56     19    171     15    167    115     25     50    144    164    141     73    133      0    181     59    110    131    115     90     29     56     67    185    207     28    199     51
     30     35    125    162     10    193     14     66    156    134     38     22     40    109     48    181      0    122     75     49     66     94    152    125    114     11     25    154     20    130
    148     91     10     40    112     72    108     56     35     22     85    106     82     20     74     59    122      0     53     72     56     36     29      5      7    127    148     34    140      9
     98     40     53     91     65    120     61     15     84     60     37     55     35     36     32    110     75     53      0     29     19     19     82     54     46     77    100     82     90     59
     76     21     75    112     40    143     35     17    107     85     14     35     11     60      3    131     49     72     29      0     16     46    102     75     64     54     75    105     67     80
     92     35     59     96     56    127     52      4     90     69     30     50     26     44     18    115     66     56     19     16      0     31     85     58     48     71     92     88     84     63
    117     60     34     72     83    101     80     29     65     41     56     75     53     17     48     90     94     36     19     46     31      0     63     36     29     96    119     62    109     40
    178    120     28     10    142     43    137     86     11     27    115    135    112     45    103     29    152     29     82    102     85     63      0     27     37    156    177     12    169     22
    150     93      4     37    115     68    110     58     32     16     88    108     84     18     76     56    125      5     54     75     58     36     27      0     11    129    150     30    142      5
    140     83     14     47    105     79    100     48     43     26     78     98     74     15     66     67    114      7     46     64     48     29     37     11      0    119    140     41    132     16
     22     36    129    166     15    197     21     70    160    137     41     21     44    113     54    185     11    127     77     54     71     96    156    129    119      0     23    158     13    134
     16     59    151    188     35    219     40     92    182    160     63     44     66    135     74    207     25    148    100     75     92    119    177    150    140     23      0    180     13    155
    179    122     29     12    145     38    140     88      2     22    117    137    114     45    106     28    154     34     82    105     88     62     12     30     41    158    180      0    171     25
      9     49    142    179     27    210     33     83    173    150     54     34     57    126     67    199     20    140     90     67     84    109    169    142    132     13     13    171      0    147
    155     97      5     32    120     63    115     63     26     14     92    113     89     22     81     51    130      9     59     80     63     40     22      5     16    134    155     25    147      0