# bench EOLE photo, generated by bep version 0.1, generation model "A"
bEpInstance_A_20_85
     20     85    100   1000     30     60     50    250    100    4.0
      1     95    590     51    490    690    187
      2     87    744     34    644    844    159
      3     43    163     38     63    263    195
      4     57    357     53    257    457    154
      5     38    911     41    811   1011    190
      6      8    301     50    201    401    144
      7     95    660     52    560    760    157
      8     77     69     38    -31    169    192
      9     66    969     42    869   1069    155
     10     71    555     32    455    655     79
     11     72    340     57    240    440    108
     12     70    615     55    515    715     66
     13     53    183     54     83    283    173
     14     48    450     32    350    550    136
     15     11    827     60    727    927    226
     16     90    235     48    135    335    161
     17     20    987     32    887   1087    234
     18     54    154     31     54    254    102
     19     49    936     46    836   1036     88
     20     55    360     38    260    460     65
      0     38    107     59     81     75     17    130     95     10     62      8    102     36     62     88    101    109     87     58
     38      0    145     97     43    112     21    168     56     47    101     32    140     74     28    127     63    147     48     96
    107    145      0     48    187     35    124     24    201     98     44    113      5     71    166     21    206      3    193     49
     59     97     48      0    138     18     76     72    153     49      5     64     43     23    118     31    157     50    144      0
     81     43    187    138      0    152     64    210     16     89    143     74    182    115     22    169     19    189      6    137
     75    112     35     18    152      0     92     60    167     65     18     80     31     38    131     26    171     38    159     18
     17     21    124     76     64     92      0    147     77     26     80     12    119     53     46    106     83    126     69     75
    130    168     24     72    210     60    147      0    225    121     67    136     29     95    190     41    229     22    216     72
     95     56    201    153     16    167     77    225      0    103    157     88    196    129     38    183     12    203      9    152
     10     47     98     49     89     65     26    121    103      0     53     15     93     26     69     80    108    100     95     48
     62    101     44      5    143     18     80     67    157     53      0     68     39     28    122     26    162     46    149      6
      8     32    113     64     74     80     12    136     88     15     68      0    108     41     55     95     93    115     80     63
    102    140      5     43    182     31    119     29    196     93     39    108      0     66    161     15    201      7    188     44
     36     74     71     23    115     38     53     95    129     26     28     41     66      0     94     54    134     74    121     22
     62     28    166    118     22    131     46    190     38     69    122     55    161     94      0    149     40    168     28    117
     88    127     21     31    169     26    106     41    183     80     26     95     15     54    149      0    188     22    175     32
    101     63    206    157     19    171     83    229     12    108    162     93    201    134     40    188      0    208     14    156
    109    147      3     50    189     38    126     22    203    100     46    115      7     74    168     22    208      0    195     51
     87     48    193    144      6    159     69    216      9     95    149     80    188    121     28    175     14    195      0    144
     58     96     49      0    137     18     75     72    152     48      6     63     44     22    117     32    156     51    144      0