# bench EOLE photo, generated by bep version 0.1, generation model "A"
bEpInstance_A_30_57
     30     57    100   1000     30     60     50    250    100    4.0
      1     92    527     52    427    627     95
      2     72    562     31    462    662    208
      3     38    298     45    198    398     88
      4     34    915     60    815   1015    182
      5     81    514     44    414    614     85
      6      6    288     30    188    388     67
      7      2    253     41    153    353    164
      8     70    291     46    191    391    171
      9     82    253     55    153    353    157
     10     82    887     40    787    987     90
     11     18    834     42    734    934    155
     12     75    373     35    273    473    162
     13     89    652     52    552    752    241
     14     94    736     31    636    836    243
     15     99    414     46    314    514    187
     16     71     56     38    -44    156    155
     17     31    120     31     20    220     75
     18      0    383     40    283    483     88
     19     21    718     52    618    818    244
     20      9    900     46    800   1000    246
     21     55    257     58    157    357    148
     22    100    972     44    872   1072    247
     23     38    991     50    891   1091     68
     24      4    954     49    854   1054    121
     25      7    672     44    572    772     66
     26      5    808     38    708    908    104
     27     52    987     37    887   1087    173
     28     89    763     48    663    863    138
     29      2    525     58    425    625     52
     30     50    388     60    288    488    227
      0     10     58     98      4     63     72     59     68     90     78     38     31     52     28    117    102     42     50     95     68    111    116    108     42     73    115     59     22     36
     10      0     66     88     12     70     79     67     77     81     69     47     22     43     37    126    110     48     41     85     76    102    107     99     31     63    106     50     19     43
     58     66      0    154     55      8     14      8     15    147    134     20     89    110     32     61     44     23    105    150     11    169    173    164     93    127    172    116     57     22
     98     88    154      0    100    156    165    156    165     13     20    135     67     47    126    214    198    133     49      7    164     21     19     12     61     27     18     40     97    131
      4     12     55    100      0     59     68     55     65     93     81     35     34     55     25    114     99     38     53     98     64    114    119    111     43     75    118     62     19     32
     63     70      8    156     59      0      8     16     20    150    136     27     93    114     39     60     42     23    107    153     14    172    175    166     96    130    175    120     59     27
     72     79     14    165     68      8      0     19     20    159    145     35    102    122     46     52     34     32    116    161     13    181    184    175    104    138    183    129     68     35
     59     67      8    156     55     16     19      0      9    149    136     20     90    111     31     58     43     28    107    153      9    170    175    166     96    130    174    118     60     24
     68     77     15    165     65     20     20      9      0    158    146     30     99    120     40     49     35     38    117    162      6    179    184    176    106    140    183    127     70     34
     90     81    147     13     93    150    159    149    158      0     20    128     58     37    118    207    192    127     44     18    157     21     28     25     56     27     26     31     92    125
     78     69    134     20     81    136    145    136    146     20      0    116     48     31    106    194    178    112     29     16    144     40     39     30     40      7     39     25     77    111
     38     47     20    135     35     27     35     20     30    128    116      0     69     90     11     79     64     18     87    132     29    149    154    146     76    110    153     97     42      7
     31     22     89     67     34     93    102     90     99     58     48     69      0     21     59    149    133     70     23     65     99     80     85     78     21     44     84     27     38     66
     52     43    110     47     55    114    122    111    120     37     31     90     21      0     80    170    154     91     18     46    120     59     65     58     27     28     63      6     57     87
     28     37     32    126     25     39     46     31     40    118    106     11     59     80      0     89     75     25     78    123     40    139    145    137     68    101    143     87     36     13
    117    126     61    214    114     60     52     58     49    207    194     79    149    170     89      0     18     83    165    211     50    229    233    225    154    188    232    176    118     83
    102    110     44    198     99     42     34     43     35    192    178     64    133    154     75     18      0     66    149    195     34    213    217    208    138    172    216    161    101     67
     42     48     23    133     38     23     32     28     38    127    112     18     70     91     25     83     66      0     83    129     34    149    152    142     72    106    151     97     35     12
     50     41    105     49     53    107    116    107    117     44     29     87     23     18     78    165    149     83      0     45    115     66     68     59     12     22     67     20     48     82
     95     85    150      7     98    153    161    153    162     18     16    132     65     46    123    211    195    129     45      0    161     29     23     13     57     23     24     39     93    128
     68     76     11    164     64     14     13      9      6    157    144     29     99    120     40     50     34     34    115    161      0    179    183    174    104    138    182    126     68     32
    111    102    169     21    114    172    181    170    179     21     40    149     80     59    139    229    213    149     66     29    179      0     16     24     78     47     12     52    114    146
    116    107    173     19    119    175    184    175    184     28     39    154     85     65    145    233    217    152     68     23    183     16      0     12     80     46      3     58    116    150
    108     99    164     12    111    166    175    166    176     25     30    146     78     58    137    225    208    142     59     13    174     24     12      0     70     36     14     52    107    141
     42     31     93     61     43     96    104     96    106     56     40     76     21     27     68    154    138     72     12     57    104     78     80     70      0     34     79     30     36     71
     73     63    127     27     75    130    138    130    140     27      7    110     44     28    101    188    172    106     22     23    138     47     46     36     34      0     46     23     70    105
    115    106    172     18    118    175    183    174    183     26     39    153     84     63    143    232    216    151     67     24    182     12      3     14     79     46      0     56    116    149
     59     50    116     40     62    120    129    118    127     31     25     97     27      6     87    176    161     97     20     39    126     52     58     52     30     23     56      0     63     94
     22     19     57     97     19     59     68     60     70     92     77     42     38     57     36    118    101     35     48     93     68    114    116    107     36     70    116     63      0     36
     36     43     22    131     32     27     35     24     34    125    111      7     66     87     13     83     67     12     82    128     32    146    150    141     71    105    149     94     36      0