# bench EOLE photo, generated by bep version 0.1, generation model "A"
bEpInstance_A_35_73
     35     73    100   1000     30     60     50    250    100    4.0
      1     13    128     47     28    228    218
      2     15     85     39    -15    185    150
      3     76    640     50    540    740    104
      4     75    228     40    128    328    149
      5     70    724     46    624    824    199
      6     70    632     36    532    732    250
      7     67    393     36    293    493     82
      8     14    276     40    176    376    105
      9     40    904     33    804   1004    162
     10     99    438     31    338    538    200
     11      7    707     30    607    807    215
     12     94    350     39    250    450    177
     13      7    859     41    759    959    206
     14     49    601     53    501    701     82
     15    100    975     40    875   1075     76
     16     25    664     42    564    764    181
     17     57    530     36    430    630    161
     18     97    271     39    171    371     59
     19     98    327     56    227    427    233
     20     68    190     46     90    290    201
     21      4    923     46    823   1023    158
     22     52    303     51    203    403    154
     23     28     24     50    -76    124    156
     24     69     64     35    -36    164    101
     25     60    395     55    295    495    162
     26     67    118     48     18    218    179
     27     45    476     47    376    576     74
     28     67    101     57      1    201    193
     29      2    404     37    304    504    160
     30     71    956     32    856   1056    247
     31     98    718     45    618    818    184
     32     78    694     58    594    794    125
     33      8    735     59    635    835    201
     34     86    544     42    444    644    110
     35      2    955     43    855   1055    188
      0     10    128     29    149    126     67     37    194     80    144     59    182    118    212    134    101     41     54     20    198     44     26     21     67     13     87     15     69    207    149    142    151    105    206
     10      0    139     38    160    137     78     47    204     90    155     69    193    129    223    144    111     50     63     29    209     55     15     14     78     15     98     13     79    218    159    153    162    116    217
    128    139      0    103     21      2     61     92     66     50     24     72     57     11     83     14     27     92     78    112     73     84    154    144     61    130     41    134     61     79     20     13     29     24     80
     29     38    103      0    124    101     41     19    169     52    120     30    158     93    186    109     75     12     25      9    174     19     52     41     41     27     62     31     47    182    122    116    127     79    182
    149    160     21    124      0     23     82    112     45     71     16     93     37     31     63     18     48    113     99    133     52    105    175    165     82    151     62    155     81     58      7      7     15     45     60
    126    137      2    101     23      0     59     90     68     49     24     70     58      9     86     13     25     90     76    110     74     82    152    142     59    128     39    132     59     81     22     15     30     22     82
     67     78     61     41     82     59      0     32    127     13     79     12    117     52    145     68     34     31     18     50    133     22     92     82      1     68     21     73     16    140     81     75     86     38    141
     37     47     92     19    112     90     32      0    157     45    107     27    145     81    176     97     64     20     24     25    161     11     63     54     31     41     50     45     32    170    112    105    114     69    169
    194    204     66    169     45     68    127    157      0    117     49    139     13     75     23     60     93    158    144    178     10    150    220    210    127    196    107    200    125     15     48     53     43     90     15
     80     90     50     52     71     49     13     45    117      0     71     22    107     42    134     59     25     41     27     62    123     35    105     93     14     80     16     84     25    129     70     64     77     26    131
    144    155     24    120     16     24     79    107     49     71      0     91     38     28     70     11     45    111     97    130     54    101    170    161     79    148     58    152     75     64     22     18      7     45     62
     59     69     72     30     93     70     12     27    139     22     91      0    129     63    156     80     45     19      5     40    145     15     83     71     14     58     33     62     26    151     92     86     98     48    152
    182    193     57    158     37     58    117    145     13    107     38    129      0     65     37     48     83    148    134    167     16    139    208    199    116    185     96    190    113     29     41     44     31     81     24
    118    129     11     93     31      9     52     81     75     42     28     63     65      0     94     16     17     83     69    102     81     74    144    134     51    120     31    125     50     88     31     24     35     16     89
    212    223     83    186     63     86    145    176     23    134     70    156     37     94      0     79    111    176    162    196     27    168    238    227    145    214    125    218    144      8     64     70     64    107     25
    134    144     14    109     18     13     68     97     60     59     11     80     48     16     79      0     34     99     86    118     64     90    160    150     67    136     47    141     65     73     22     15     18     33     72
    101    111     27     75     48     25     34     64     93     25     45     45     83     17    111     34      0     65     51     85     99     56    126    116     33    103     13    107     34    106     48     41     52      8    107
     41     50     92     12    113     90     31     20    158     41    111     19    148     83    176     99     65      0     14     21    164     13     64     52     32     38     52     43     40    171    111    105    118     68    172
     54     63     78     25     99     76     18     24    144     27     97      5    134     69    162     86     51     14      0     35    150     12     77     66     19     52     39     57     30    157     97     91    104     54    158
     20     29    112      9    133    110     50     25    178     62    130     40    167    102    196    118     85     21     35      0    183     28     42     31     51     18     71     22     55    191    132    126    137     88    191
    198    209     73    174     52     74    133    161     10    123     54    145     16     81     27     64     99    164    150    183      0    155    224    215    132    201    112    206    129     18     56     60     47     96      8
     44     55     84     19    105     82     22     11    150     35    101     15    139     74    168     90     56     13     12     28    155      0     70     59     23     46     43     50     28    163    104     97    108     60    163
     26     15    154     52    175    152     92     63    220    105    170     83    208    144    238    160    126     64     77     42    224     70      0     14     93     25    113     21     95    233    174    167    177    130    232
     21     14    144     41    165    142     82     54    210     93    161     71    199    134    227    150    116     52     66     31    215     59     14      0     82     13    103      9     86    223    163    157    168    120    223
     67     78     61     41     82     59      1     31    127     14     79     14    116     51    145     67     33     32     19     51    132     23     93     82      0     69     20     73     14    140     81     74     85     37    140
     13     15    130     27    151    128     68     41    196     80    148     58    185    120    214    136    103     38     52     18    201     46     25     13     69      0     89      4     73    209    150    144    154    106    209
     87     98     41     62     62     39     21     50    107     16     58     33     96     31    125     47     13     52     39     71    112     43    113    103     20     89      0     93     20    120     61     55     65     19    120
     15     13    134     31    155    132     73     45    200     84    152     62    190    125    218    141    107     43     57     22    206     50     21      9     73      4     93      0     77    213    154    148    159    110    214
     69     79     61     47     81     59     16     32    125     25     75     26    113     50    144     65     34     40     30     55    129     28     95     86     14     73     20     77      0    139     82     74     82     40    137
    207    218     79    182     58     81    140    170     15    129     64    151     29     88      8     73    106    171    157    191     18    163    233    223    140    209    120    213    139      0     59     65     57    103     17
    149    159     20    122      7     22     81    112     48     70     22     92     41     31     64     22     48    111     97    132     56    104    174    163     81    150     61    154     82     59      0      7     22     43     63
    142    153     13    116      7     15     75    105     53     64     18     86     44     24     70     15     41    105     91    126     60     97    167    157     74    144     55    148     74     65      7      0     20     37     67
    151    162     29    127     15     30     86    114     43     77      7     98     31     35     64     18     52    118    104    137     47    108    177    168     85    154     65    159     82     57     22     20      0     51     55
    105    116     24     79     45     22     38     69     90     26     45     48     81     16    107     33      8     68     54     88     96     60    130    120     37    106     19    110     40    103     43     37     51      0    104
    206    217     80    182     60     82    141    169     15    131     62    152     24     89     25     72    107    172    158    191      8    163    232    223    140    209    120    214    137     17     63     67     55    104      0