# bench EOLE photo, generated by bep version 0.1, generation model "A"
bEpInstance_A_35_9
     35      9    100   1000     30     60     50    250    100    4.0
      1     20    700     36    600    800    122
      2     89    463     52    363    563    176
      3     72    731     31    631    831    235
      4      7    929     57    829   1029     68
      5      9    331     51    231    431    231
      6      9    675     38    575    775    104
      7    100    237     39    137    337    184
      8     74    229     59    129    329    240
      9     93    141     39     41    241    213
     10     61     29     43    -71    129    115
     11     76    497     37    397    597    217
     12     42    133     58     33    233    153
     13     46    612     42    512    712    162
     14     28    681     55    581    781    105
     15     92    139     59     39    239    182
     16     37    887     48    787    987    109
     17      2    915     33    815   1015    177
     18     95    555     59    455    655    191
     19      5    208     46    108    308    145
     20     34    465     60    365    565    211
     21      7    412     41    312    512    123
     22      9    195     49     95    295     52
     23     33    591     50    491    691    191
     24     48    276     30    176    376    151
     25     19    114     34     14    214     77
     26     67     99     55     -1    199    195
     27     31    377     36    277    477    180
     28     85    192     44     92    292    234
     29     61    817     38    717    917    189
     30      1    925     51    825   1025    119
     31     52    375     31    275    475    249
     32     65     53     45    -47    153    219
     33     17    641     60    541    741    218
     34     74    815     47    715    915     59
     35     19    759     51    659    859     56
      0     61     15     57     92      6    117    118    140    168     52    141     22      5    141     46     53     40    123     58     72    126     27    106    146    150     80    128     30     56     81    162     14     31     14
     61      0     67    118     38     56     56     58     80    108      9     83     38     56     81    106    115     23     67     13     24     69     34     47     88     91     25     67     88    117     23    102     48     88     76
     15     67      0     52    101     21    123    125    147    175     58    149     30     16    148     39     49     44    131     67     81    134     36    113    154    158     89    134     21     51     89    169     26     21     14
     57    118     52      0    149     63    174    175    198    225    109    199     79     62    198     12      3     96    180    116    129    183     84    163    203    208    138    185     31      1    138    219     72     33     42
     92     38    101    149      0     86     32     30     51     76     44     50     70     87     52    139    146     59     30     34     20     34     65     16     54     59     12     39    122    148     15     70     77    122    107
      6     56     21     63     86      0    111    112    135    162     47    135     18      4    135     53     60     36    116     52     65    120     21    100    140    144     74    122     37     62     75    156      8     38     21
    117     56    123    174     32    111      0      6     24     52     65     29     94    112     24    163    171     79     24     59     49     25     90     16     36     35     39     11    145    173     36     46    103    144    132
    118     58    125    175     30    112      6      0     22     50     67     25     96    113     22    164    172     81     18     59     48     18     91     13     31     32     38      9    147    174     36     44    103    146    133
    140     80    147    198     51    135     24     22      0     29     89     12    118    135      0    187    194    103     27     82     71     24    113     35     19     12     61     12    169    197     59     23    126    168    155
    168    108    175    225     76    162     52     50     29      0    117     26    145    163     28    214    221    131     46    109     96     43    140     61     23     17     87     41    197    224     86      6    153    196    182
     52      9     58    109     44     47     65     67     89    117      0     91     29     47     89     97    106     15     74     13     27     77     25     55     96     99     32     76     80    108     31    111     38     79     67
    141     83    149    199     50    135     29     25     12     26     91      0    119    137     12    188    195    106     20     83     70     17    114     35      7     10     61     18    171    198     60     20    127    170    156
     22     38     30     79     70     18     94     96    118    145     29    119      0     17    118     68     76     18    101     36     50    104      6     84    124    128     58    105     51     79     59    139     10     51     37
      5     56     16     62     87      4    112    113    135    163     47    137     17      0    136     51     58     35    118     54     67    121     22    101    141    145     76    123     34     61     76    157     10     35     19
    141     81    148    198     52    135     24     22      0     28     89     12    118    136      0    187    195    104     27     82     71     25    113     35     19     11     61     13    169    197     59     22    126    169    156
     46    106     39     12    139     53    163    164    187    214     97    188     68     51    187      0     11     84    169    105    118    173     74    152    193    197    127    174     18     13    128    208     61     20     32
     53    115     49      3    146     60    171    172    194    221    106    195     76     58    195     11      0     92    176    112    125    180     81    160    200    204    134    181     28      2    135    216     68     30     39
     40     23     44     96     59     36     79     81    103    131     15    106     18     35    104     84     92      0     89     27     41     92     17     70    111    114     47     90     66     95     46    125     29     65     54
    123     67    131    180     30    116     24     18     27     46     74     20    101    118     27    169    176     89      0     64     51      3     96     20     23     31     42     20    152    179     43     41    108    152    137
     58     13     67    116     34     52     59     59     82    109     13     83     36     54     82    105    112     27     64      0     14     67     31     47     87     91     22     69     88    115     22    103     44     88     73
     72     24     81    129     20     65     49     48     71     96     27     70     50     67     71    118    125     41     51     14      0     54     45     35     74     79     10     58    102    128     14     90     57    102     86
    126     69    134    183     34    120     25     18     24     43     77     17    104    121     25    173    180     92      3     67     54      0     99     22     20     28     45     19    156    182     46     38    111    155    141
     27     34     36     84     65     21     90     91    113    140     25    114      6     22    113     74     81     17     96     31     45     99      0     78    119    123     53    100     56     83     54    134     13     56     42
    106     47    113    163     16    100     16     13     35     61     55     35     84    101     35    152    160     70     20     47     35     22     78      0     41     44     25     22    135    162     24     55     91    134    120
    146     88    154    203     54    140     36     31     19     23     96      7    124    141     19    193    200    111     23     87     74     20    119     41      0     12     65     25    176    202     65     19    131    175    161
    150     91    158    208     59    144     35     32     12     17     99     10    128    145     11    197    204    114     31     91     79     28    123     44     12      0     70     23    179    207     69     11    136    179    165
     80     25     89    138     12     74     39     38     61     87     32     61     58     76     61    127    134     47     42     22     10     45     53     25     65     70      0     48    110    137      5     81     66    110     95
    128     67    134    185     39    122     11      9     12     41     76     18    105    123     13    174    181     90     20     69     58     19    100     22     25     23     48      0    156    184     46     35    113    155    142
     30     88     21     31    122     37    145    147    169    197     80    171     51     34    169     18     28     66    152     88    102    156     56    135    176    179    110    156      0     30    110    191     45      3     17
     56    117     51      1    148     62    173    174    197    224    108    198     79     61    197     13      2     95    179    115    128    182     83    162    202    207    137    184     30      0    138    218     71     33     41
     81     23     89    138     15     75     36     36     59     86     31     60     59     76     59    128    135     46     43     22     14     46     54     24     65     69      5     46    110    138      0     80     67    110     96
    162    102    169    219     70    156     46     44     23      6    111     20    139    157     22    208    216    125     41    103     90     38    134     55     19     11     81     35    191    218     80      0    147    190    176
     14     48     26     72     77      8    103    103    126    153     38    127     10     10    126     61     68     29    108     44     57    111     13     91    131    136     66    113     45     71     67    147      0     45     29
     31     88     21     33    122     38    144    146    168    196     79    170     51     35    169     20     30     65    152     88    102    155     56    134    175    179    110    155      3     33    110    190     45      0     19
     14     76     14     42    107     21    132    133    155    182     67    156     37     19    156     32     39     54    137     73     86    141     42    120    161    165     95    142     17     41     96    176     29     19      0