# bench EOLE photo, generated by bep version 0.1, generation model "A"
bEpInstance_A_15_18
     15     18    100   1000     30     60     50    250    100    4.0
      1     93    913     58    813   1013     97
      2     79    947     59    847   1047    105
      3     46    487     34    387    587    125
      4     68    887     54    787    987     94
      5     21    200     58    100    300    120
      6     74    904     47    804   1004     70
      7      4     35     35    -65    135    234
      8      5     34     44    -66    134    247
      9     95    391     36    291    491    197
     10     34    188     30     88    288    211
     11     68    144     35     44    244    121
     12      3    979     47    879   1079     99
     13     18    493     48    393    593    233
     14     40    167     30     67    267    139
     15     20    193     41     93    293    102
      0      9    107      9    179      5    220    220    130    181    192     27    106    186    180
      9      0    115     15    187     10    228    228    139    190    200     20    114    195    189
    107    115      0    100     72    104    113    113     26     74     85    123      7     80     73
      9     15    100      0    172      4    213    213    124    174    185     28     99    180    173
    179    187     72    172      0    176     41     41     51      4     18    194     73      9      1
      5     10    104      4    176      0    217    218    128    179    190     25    103    184    178
    220    228    113    213     41    217      0      0     91     38     31    236    114     34     39
    220    228    113    213     41    218      0      0     92     39     31    236    114     34     39
    130    139     26    124     51    128     91     92      0     52     62    148     31     57     52
    181    190     74    174      4    179     38     39     52      0     13    197     76      5      3
    192    200     85    185     18    190     31     31     62     13      0    209     88      9     17
     27     20    123     28    194     25    236    236    148    197    209      0    121    203    196
    106    114      7     99     73    103    114    114     31     76     88    121      0     81     75
    186    195     80    180      9    184     34     34     57      5      9    203     81      0      8
    180    189     73    173      1    178     39     39     52      3     17    196     75      8      0