# bench EOLE photo, generated by bep version 0.1, generation model "A"
bEpInstance_A_25_26
     25     26    100   1000     30     60     50    250    100    4.0
      1     80    215     40    115    315    109
      2     25    710     56    610    810    177
      3     40    664     51    564    764     83
      4     89    297     52    197    397    129
      5     67    308     44    208    408     78
      6     30    335     51    235    435    162
      7     88    366     40    266    466    246
      8     29     32     57    -68    132     67
      9     24    231     41    131    331    151
     10     95    238     34    138    338    119
     11     91    844     45    744    944    208
     12     14    240     35    140    340    211
     13     55    647     59    547    747    221
     14     99    636     42    536    736    223
     15      0    761     56    661    861    109
     16     80    729     41    629    829     58
     17     96    764     46    664    864    231
     18      0    682     37    582    782    231
     19     53    761     51    661    861    183
     20      0    882     44    782    982    160
     21     53    414     42    314    514    152
     22      5    819     41    719    919     60
     23     58    213     40    113    313    124
     24     95    727     42    627    827    231
     25     49    956     54    856   1056    149
      0    124    112     20     23     32     37     47     14      6    157     17    108    105    137    128    137    118    136    167     50    152      5    128    185
    124      0     12    104    101     93     87    169    119    119     37    117     17     26     14     14     22      9     14     43     74     27    124     18     61
    112     12      0     92     89     82     75    158    108    107     46    106      5     16     26     19     28     10     24     55     62     39    112     20     73
     20    104     92      0      6     17     17     67     23     14    136     23     87     84    118    108    116     98    116    147     30    132     22    107    165
     23    101     89      6      0     11     15     69     22     18    134     21     84     82    114    105    114     94    113    144     26    128     23    104    162
     32     93     82     17     11      0     16     75     26     29    128     24     78     77    106     99    108     87    106    136     20    121     31     99    155
     37     87     75     17     15     16      0     84     37     32    119     36     70     67    101     90     99     82     99    130     14    115     38     90    147
     47    169    158     67     69     75     84      0     49     54    203     52    153    152    182    174    183    162    182    212     95    196     45    174    231
     14    119    108     23     22     26     37     49      0     17    154      3    104    102    132    125    134    112    132    162     46    147      9    125    181
      6    119    107     14     18     29     32     54     17      0    151     20    102     99    132    122    131    113    131    162     45    146     11    122    179
    157     37     46    136    134    128    119    203    154    151      0    152     50     52     30     28     20     46     22     24    107     22    157     29     29
     17    117    106     23     21     24     36     52      3     20    152      0    102    101    130    123    132    110    130    160     44    144     12    123    179
    108     17      5     87     84     78     70    153    104    102     50    102      0     11     31     21     30     16     28     60     58     44    108     22     77
    105     26     16     84     82     77     67    152    102     99     52    101     11      0     39     23     32     27     33     66     56     51    106     22     80
    137     14     26    118    114    106    101    182    132    132     30    130     31     39      0     21     24     19     13     30     87     14    137     25     50
    128     14     19    108    105     99     90    174    125    122     28    123     21     23     21      0      9     23     10     43     79     29    129      3     57
    137     22     28    116    114    108     99    183    134    131     20    132     30     32     24      9      0     31     10     38     88     26    138      9     49
    118      9     10     98     94     87     82    162    112    113     46    110     16     27     19     23     31      0     23     50     68     34    118     26     69
    136     14     24    116    113    106     99    182    132    131     22    130     28     33     13     10     10     23      0     33     86     18    137     13     48
    167     43     55    147    144    136    130    212    162    162     24    160     60     66     30     43     38     50     33      0    117     15    167     45     22
     50     74     62     30     26     20     14     95     46     45    107     44     58     56     87     79     88     68     86    117      0    101     50     78    135
    152     27     39    132    128    121    115    196    147    146     22    144     44     51     14     29     26     34     18     15    101      0    152     32     35
      5    124    112     22     23     31     38     45      9     11    157     12    108    106    137    129    138    118    137    167     50    152      0    128    185
    128     18     20    107    104     99     90    174    125    122     29    123     22     22     25      3      9     26     13     45     78     32    128      0     58
    185     61     73    165    162    155    147    231    181    179     29    179     77     80     50     57     49     69     48     22    135     35    185     58      0