# bench EOLE photo, generated by bep version 0.1, generation model "A"
bEpInstance_A_15_93
     15     93    100   1000     30     60     50    250    100    4.0
      1     81    898     49    798    998    200
      2     34    513     47    413    613    232
      3     89    344     40    244    444     54
      4     79    277     51    177    377    191
      5     34    532     43    432    632    150
      6     17    743     54    643    843    241
      7     80      5     43    -95    105    173
      8     52    595     51    495    695    117
      9     49    333     32    233    433    217
     10     85    632     53    532    732    196
     11     98     93     53     -7    193    203
     12     37    435     44    335    535    193
     13     97    890     36    790    990     78
     14     63     18     32    -82    118    135
     15      2    525     31    425    625    160
      0     96    138    155     92     41    223     76    141     66    201    116      4    220     95
     96      0     44     60      4     57    127     20     45     32    106     19     95    123      8
    138     44      0     16     48    101     84     63     10     72     62     26    136     81     50
    155     60     16      0     64    117     68     79     15     88     46     40    153     64     64
     92      4     48     64      0     52    132     16     49     28    110     24     90    128      8
     41     57    101    117     52      0    185     38    102     32    163     77     41    181     54
    223    127     84     68    132    185      0    147     82    156     22    108    221      5    131
     76     20     63     79     16     38    147      0     65     12    126     40     74    144     21
    141     45     10     15     49    102     82     65      0     75     61     25    139     78     49
     66     32     72     88     28     32    156     12     75      0    134     50     64    153     33
    201    106     62     46    110    163     22    126     61    134      0     86    199     20    110
    116     19     26     40     24     77    108     40     25     50     86      0    114    104     24
      4     95    136    153     90     41    221     74    139     64    199    114      0    218     94
    220    123     81     64    128    181      5    144     78    153     20    104    218      0    127
     95      8     50     64      8     54    131     21     49     33    110     24     94    127      0