# bench EOLE photo, generated by bep version 0.1, generation model "A"
bEpInstance_A_15_47
     15     47    100   1000     30     60     50    250    100    4.0
      1     83    896     36    796    996     54
      2     38    355     59    255    455    118
      3     33    949     42    849   1049    165
      4     83    396     47    296    496     61
      5    100    874     46    774    974     60
      6     85    742     44    642    842    125
      7     73    454     54    354    554    172
      8     76    656     41    556    756    168
      9     55    562     48    462    662    236
     10     92    553     38    453    653     99
     11     50    682     55    582    782    115
     12      7    388     41    288    488     63
     13     26    918     33    818   1018     71
     14     66    593     44    493    693    126
     15      4    262     60    162    362    212
      0    135     18    125      6     38    110     60     83     85     54    128     15     75    159
    135      0    148     15    130     97     26     75     51     51     81     11    140     59     24
     18    148      0    138     25     53    124     74     96    100     66    140      7     89    171
    125     15    138      0    119     86     14     65     42     39     71     19    131     49     38
      6    130     25    119      0     33    105     54     78     80     49    123     21     70    154
     38     97     53     86     33      0     72     21     45     47     17     90     46     37    121
    110     26    124     14    105     72      0     50     27     25     57     23    116     34     51
     60     75     74     65     54     21     50      0     24     26      9     69     66     15    100
     83     51     96     42     78     45     27     24      0      9     30     45     89      8     76
     85     51    100     39     80     47     25     26      9      0     33     46     92     11     76
     54     81     66     71     49     17     57      9     30     33      0     74     59     22    105
    128     11    140     19    123     90     23     69     45     46     74      0    132     53     31
     15    140      7    131     21     46    116     66     89     92     59    132      0     81    164
     75     59     89     49     70     37     34     15      8     11     22     53     81      0     84
    159     24    171     38    154    121     51    100     76     76    105     31    164     84      0