# bench EOLE photo, generated by bep version 0.1, generation model "A"
bEpInstance_A_15_40
     15     40    100   1000     30     60     50    250    100    4.0
      1     82    506     32    406    606    207
      2     34    812     58    712    912    105
      3     19    861     40    761    961    139
      4      2     37     34    -63    137    119
      5     73    529     51    429    629    236
      6     85    119     31     19    219    107
      7     63    607     39    507    707    200
      8     63    970     31    870   1070    139
      9     48    146     37     46    246    214
     10     96    147     32     47    247     80
     11      0    444     48    344    544     55
     12     48    729     41    629    829     91
     13     26     62     34    -38    162     70
     14     18    190     42     90    290    212
     15     80    709     47    609    809    134
      0     77     90    118      6     96     25    116     90     89     25     56    111     80     50
     77      0     12    193     71    173     51     40    166    166     92     21    187    155     28
     90     12      0    206     84    186     64     29    178    179    104     33    199    167     40
    118    193    206      0    124     29    143    233     29     36    101    173      8     38    169
      6     71     84    124      0    102     19    110     95     95     28     50    117     85     45
     96    173    186     29    102      0    122    212     11      7     83    152     20     24    147
     25     51     64    143     19    122      0     90    115    115     43     30    136    104     25
    116     40     29    233    110    212     90      0    206    205    132     60    227    195     65
     90    166    178     29     95     11    115    206      0     12     75    145     21     13    140
     89    166    179     36     95      7    115    205     12      0     78    145     27     22    140
     25     92    104    101     28     83     43    132     75     78      0     72     95     63     69
     56     21     33    173     50    152     30     60    145    145     72      0    166    134      9
    111    187    199      8    117     20    136    227     21     27     95    166      0     32    162
     80    155    167     38     85     24    104    195     13     22     63    134     32      0    130
     50     28     40    169     45    147     25     65    140    140     69      9    162    130      0