# bench EOLE photo, generated by bep version 0.1, generation model "A"
bEpInstance_A_10_43
     10     43    100   1000     30     60     50    250    100    4.0
      1     39    241     45    141    341    199
      2     14    970     45    870   1070     81
      3     61    610     57    510    710    235
      4     72    185     32     85    285    194
      5     76    310     37    210    410    231
      6      4    523     34    423    623    227
      7     30     33     43    -67    133    215
      8     89    889     57    789    989    106
      9     13    380     30    280    480    103
     10     35    521     43    421    621    241
      0    182     92     16     19     71     52    162     35     70
    182      0     90    196    165    111    234     27    147    112
     92     90      0    106     75     26    144     70     58     23
     16    196    106      0     31     86     39    176     50     84
     19    165     75     31      0     56     70    144     23     53
     71    111     26     86     56      0    122     93     35      7
     52    234    144     39     70    122      0    214     86    122
    162     27     70    176    144     93    214      0    128     92
     35    147     58     50     23     35     86    128      0     35
     70    112     23     84     53      7    122     92     35      0