# bench EOLE photo, generated by bep version 0.1, generation model "A"
bEpInstance_A_35_45
     35     45    100   1000     30     60     50    250    100    4.0
      1     61     68     48    -32    168    227
      2      0    911     52    811   1011    200
      3     21    279     42    179    379     99
      4     52    291     32    191    391    178
      5     63    839     34    739    939    196
      6     19    129     31     29    229     75
      7     26    494     56    394    594    193
      8     58     17     49    -83    117     87
      9      8    214     32    114    314     68
     10     12    787     56    687    887    118
     11      6    235     48    135    335    168
     12     53    665     37    565    765     80
     13     50    369     57    269    469    190
     14     50    945     55    845   1045    202
     15     44    674     44    574    774     52
     16     69     87     36    -13    187    206
     17     30    266     57    166    366    135
     18      5    713     53    613    813     73
     19     95    352     51    252    452    145
     20      1    933     49    833   1033    154
     21     30    507     36    407    607    210
     22     45     40     47    -60    140    229
     23     72     29     58    -71    129    131
     24     11    103     35      3    203    134
     25     37     54     56    -46    154    134
     26     77    610     46    510    710    193
     27     97    247     35    147    347    246
     28     18    815     45    715    915    146
     29     32    716     38    616    816    205
     30     76    841     50    741    941    144
     31     87    569     57    469    669    248
     32     67     57     42    -43    157     58
     33     11    250     44    150    350    226
     34     86      5     48    -95    105    215
     35     25    784     54    684    884    136
      0    211     53     55    192     18    106     12     38    180     43    149     75    219    151      5     50    161     71    216    110      8     10     15      6    135     45    187    162    193    125      3     47     16    179
    211      0    158    155     23    195    104    223    174     31    169     62    136     15     60    206    161     49    141      5    101    218    221    202    214     77    167     24     49     25     88    214    165    227     32
     53    158      0      8    140     37     53     66     16    127     11     96     23    166     98     49      3    108     25    163     57     60     63     44     56     83     20    134    109    141     74     56      7     70    126
     55    155      8      0    137     41     51     68     22    124     18     93     19    163     95     51      8    106     18    161     54     62     65     48     59     79     15    131    106    137     70     58     14     72    123
    192     23    140    137      0    177     86    205    156     18    151     43    117     26     41    188    143     34    122     28     83    199    202    184    196     57    148     12     31      3     67    195    147    208     16
     18    195     37     41    177      0     91     29     21    164     26    134     60    204    136     16     34    146     58    201     94     23     28      6     19    121     35    171    146    178    111     21     30     35    163
    106    104     53     51     86     91      0    119     70     73     64     43     31    112     45    102     57     55     39    109      3    113    116     97    110     31     64     80     55     87     24    109     61    123     72
     12    223     66     68    205     29    119      0     50    192     56    162     88    232    164     17     62    174     84    229    122      6      4     24     10    148     58    199    174    206    138     10     59      7    191
     38    174     16     22    156     21     70     50      0    143      5    113     40    183    115     35     14    124     40    179     73     44     48     27     40    100     23    150    125    157     90     41      9     55    142
    180     31    127    124     18    164     73    192    143      0    138     32    104     40     29    175    130     18    110     36     70    186    190    171    183     47    136      7     18     20     57    183    134    196      3
     43    169     11     18    151     26     64     56      5    138      0    108     35    177    110     40      9    119     36    174     68     49     54     33     45     95     22    145    120    152     85     47      3     60    137
    149     62     96     93     43    134     43    162    113     32    108      0     74     70      3    144     99     16     78     68     39    156    159    140    152     15    105     38     13     44     25    152    104    165     30
     75    136     23     19    117     60     31     88     40    104     35     74      0    144     76     70     26     86     12    141     34     82     85     67     78     60     32    111     86    118     50     78     31     91    103
    219     15    166    163     26    204    112    232    183     40    177     70    144      0     67    214    169     59    148     12    109    226    229    210    222     84    174     33     57     26     94    222    174    235     40
    151     60     98     95     41    136     45    164    115     29    110      3     76     67      0    146    102     13     81     65     41    158    161    142    155     18    107     35     10     42     28    154    106    167     27
      5    206     49     51    188     16    102     17     35    175     40    144     70    214    146      0     45    157     66    212    105     13     14     15     11    130     40    182    157    188    120      7     43     20    174
     50    161      3      8    143     34     57     62     14    130      9     99     26    169    102     45      0    111     26    166     60     56     60     41     53     86     17    137    112    144     77     53      6     66    129
    161     49    108    106     34    146     55    174    124     18    119     16     86     59     13    157    111      0     93     55     51    168    171    152    164     31    118     25      6     36     41    164    115    178     18
     71    141     25     18    122     58     39     84     40    110     36     78     12    148     81     66     26     93      0    147     42     78     80     65     75     64     26    117     92    122     54     74     33     86    109
    216      5    163    161     28    201    109    229    179     36    174     68    141     12     65    212    166     55    147      0    106    223    226    207    219     82    173     29     54     29     93    219    170    232     37
    110    101     57     54     83     94      3    122     73     70     68     39     34    109     41    105     60     51     42    106      0    116    119    101    113     28     67     77     52     84     21    112     64    126     69
      8    218     60     62    199     23    113      6     44    186     49    156     82    226    158     13     56    168     78    223    116      0      7     17      4    142     53    193    169    200    132      6     53     13    186
     10    221     63     65    202     28    116      4     48    190     54    159     85    229    161     14     60    171     80    226    119      7      0     23     10    145     54    196    172    203    135      7     57      6    189
     15    202     44     48    184      6     97     24     27    171     33    140     67    210    142     15     41    152     65    207    101     17     23      0     13    127     41    178    153    185    118     18     36     30    170
      6    214     56     59    196     19    110     10     40    183     45    152     78    222    155     11     53    164     75    219    113      4     10     13      0    139     50    190    165    196    129      7     49     17    182
    135     77     83     79     57    121     31    148    100     47     95     15     60     84     18    130     86     31     64     82     28    142    145    127    139      0     90     53     28     57     10    138     91    151     45
     45    167     20     15    148     35     64     58     23    136     22    105     32    174    107     40     17    118     26    173     67     53     54     41     50     90      0    143    118    148     80     48     21     60    135
    187     24    134    131     12    171     80    199    150      7    145     38    111     33     35    182    137     25    117     29     77    193    196    178    190     53    143      0     24     15     63    189    141    203      7
    162     49    109    106     31    146     55    174    125     18    120     13     86     57     10    157    112      6     92     54     52    169    172    153    165     28    118     24      0     33     39    164    116    178     17
    193     25    141    137      3    178     87    206    157     20    152     44    118     26     42    188    144     36    122     29     84    200    203    185    196     57    148     15     33      0     68    196    148    209     19
    125     88     74     70     67    111     24    138     90     57     85     25     50     94     28    120     77     41     54     93     21    132    135    118    129     10     80     63     39     68      0    128     81    141     55
      3    214     56     58    195     21    109     10     41    183     47    152     78    222    154      7     53    164     74    219    112      6      7     18      7    138     48    189    164    196    128      0     50     13    182
     47    165      7     14    147     30     61     59      9    134      3    104     31    174    106     43      6    115     33    170     64     53     57     36     49     91     21    141    116    148     81     50      0     64    133
     16    227     70     72    208     35    123      7     55    196     60    165     91    235    167     20     66    178     86    232    126     13      6     30     17    151     60    203    178    209    141     13     64      0    195
    179     32    126    123     16    163     72    191    142      3    137     30    103     40     27    174    129     18    109     37     69    186    189    170    182     45    135      7     17     19     55    182    133    195      0