# bench EOLE photo, generated by bep version 0.1, generation model "A"
bEpInstance_A_15_87
     15     87    100   1000     30     60     50    250    100    4.0
      1     16    922     39    822   1022    217
      2     24    192     42     92    292     79
      3     56    841     39    741    941     61
      4     89    973     52    873   1073    141
      5     77    453     38    353    553     57
      6     25    426     48    326    526     96
      7     43    142     35     42    242    140
      8     99    727     46    627    827     79
      9     65    840     60    740    940    228
     10      3    364     31    264    464    167
     11     20    331     49    231    431     67
     12     30    381     46    281    481     63
     13     84    815     33    715    915     67
     14     24    701     39    601    801    184
     15     85    504     33    404    604    215
      0    182     22     22    118    124    195     52     23    139    147    135     31     55    105
    182      0    162    195     66     58     13    135    162     43     34     47    156    127     79
     22    162      0     34     97    104    174     30      2    119    127    115      9     35     84
     22    195     34      0    130    137    208     61     33    153    161    148     39     69    117
    118     66     97    130      0     14     78     68     96     28     33     21     90     63     12
    124     58    104    137     14      0     71     77    103     16     23     11     98     68     24
    195     13    174    208     78     71      0    146    174     56     47     59    168    139     91
     52    135     30     61     68     77    146      0     29     93    100     88     22     19     55
     23    162      2     33     96    103    174     29      0    120    127    115      7     36     84
    139     43    119    153     28     16     56     93    120      0      9      7    114     84     40
    147     34    127    161     33     23     47    100    127      9      0     12    122     92     46
    135     47    115    148     21     11     59     88    115      7     12      0    109     80     33
     31    156      9     39     90     98    168     22      7    114    122    109      0     32     77
     55    127     35     69     63     68    139     19     36     84     92     80     32      0     51
    105     79     84    117     12     24     91     55     84     40     46     33     77     51      0