# bench EOLE photo, generated by bep version 0.1, generation model "A"
bEpInstance_A_20_57
     20     57    100   1000     30     60     50    250    100    4.0
      1     92    527     52    427    627     95
      2     72    562     31    462    662    208
      3     38    298     45    198    398     88
      4     34    915     60    815   1015    182
      5     81    514     44    414    614     85
      6      6    288     30    188    388     67
      7      2    253     41    153    353    164
      8     70    291     46    191    391    171
      9     82    253     55    153    353    157
     10     82    887     40    787    987     90
     11     18    834     42    734    934    155
     12     75    373     35    273    473    162
     13     89    652     52    552    752    241
     14     94    736     31    636    836    243
     15     99    414     46    314    514    187
     16     71     56     38    -44    156    155
     17     31    120     31     20    220     75
     18      0    383     40    283    483     88
     19     21    718     52    618    818    244
     20      9    900     46    800   1000    246
      0     10     58     98      4     63     72     59     68     90     78     38     31     52     28    117    102     42     50     95
     10      0     66     88     12     70     79     67     77     81     69     47     22     43     37    126    110     48     41     85
     58     66      0    154     55      8     14      8     15    147    134     20     89    110     32     61     44     23    105    150
     98     88    154      0    100    156    165    156    165     13     20    135     67     47    126    214    198    133     49      7
      4     12     55    100      0     59     68     55     65     93     81     35     34     55     25    114     99     38     53     98
     63     70      8    156     59      0      8     16     20    150    136     27     93    114     39     60     42     23    107    153
     72     79     14    165     68      8      0     19     20    159    145     35    102    122     46     52     34     32    116    161
     59     67      8    156     55     16     19      0      9    149    136     20     90    111     31     58     43     28    107    153
     68     77     15    165     65     20     20      9      0    158    146     30     99    120     40     49     35     38    117    162
     90     81    147     13     93    150    159    149    158      0     20    128     58     37    118    207    192    127     44     18
     78     69    134     20     81    136    145    136    146     20      0    116     48     31    106    194    178    112     29     16
     38     47     20    135     35     27     35     20     30    128    116      0     69     90     11     79     64     18     87    132
     31     22     89     67     34     93    102     90     99     58     48     69      0     21     59    149    133     70     23     65
     52     43    110     47     55    114    122    111    120     37     31     90     21      0     80    170    154     91     18     46
     28     37     32    126     25     39     46     31     40    118    106     11     59     80      0     89     75     25     78    123
    117    126     61    214    114     60     52     58     49    207    194     79    149    170     89      0     18     83    165    211
    102    110     44    198     99     42     34     43     35    192    178     64    133    154     75     18      0     66    149    195
     42     48     23    133     38     23     32     28     38    127    112     18     70     91     25     83     66      0     83    129
     50     41    105     49     53    107    116    107    117     44     29     87     23     18     78    165    149     83      0     45
     95     85    150      7     98    153    161    153    162     18     16    132     65     46    123    211    195    129     45      0