# bench EOLE photo, generated by bep version 0.1, generation model "A"
bEpInstance_A_20_59
     20     59    100   1000     30     60     50    250    100    4.0
      1     12    854     40    754    954    123
      2      8    504     38    404    604    126
      3    100    465     30    365    565    154
      4     14    518     44    418    618     65
      5     67     44     40    -56    144    150
      6     21    393     58    293    493    216
      7     98    209     39    109    309    141
      8     38    922     37    822   1022    151
      9     78    586     56    486    686    223
     10      9    143     37     43    243     67
     11     61    269     48    169    369    200
     12     79     66     55    -34    166    142
     13     11    176     59     76    276    115
     14     57    866     34    766    966    160
     15      7    449     30    349    549    140
     16     37    255     59    155    355     79
     17     85    824     30    724    924    237
     18     97    249     30    149    349    165
     19     52    619     40    519    719    111
     20     69    148     53     48    248    210
      0     87     99     84    202    115    162     18     69    177    146    197    169     11    101    149     19    152     59    177
     87      0     24      3    115     27     77    104     26     90     60    110     82     91     13     62     82     67     30     90
     99     24      0     25    105     26     64    115     30     83     49     99     75    100     23     54     89     54     40     79
     84      3     25      0    119     31     80    101     23     93     63    114     85     87     17     66     78     70     26     93
    202    115    105    119      0     88     41    219    135     28     56      6     35    205    102     53    195     51    143     26
    115     27     26     31     88      0     49    132     50     62     32     83     54    118     14     34    108     40     57     62
    162     77     64     80     41     49      0    178     94     27     17     36     23    164     64     19    153     10    103     16
     18    104    115    101    219    132    178      0     84    194    163    214    186     14    118    166     27    168     75    193
     69     26     30     23    135     50     94     84      0    112     79    130    103     70     38     83     59     84     10    109
    177     90     83     93     28     62     27    194    112      0     34     26      8    181     76     28    171     34    119     15
    146     60     49     63     56     32     17    163     79     34      0     50     26    149     46      6    138     10     87     30
    197    110     99    114      6     83     36    214    130     26     50      0     32    200     97     48    189     45    138     20
    169     82     75     85     35     54     23    186    103      8     26     32      0    172     68     20    163     28    111     16
     11     91    100     87    205    118    164     14     70    181    149    200    172      0    104    152     12    154     61    179
    101     13     23     17    102     14     64    118     38     76     46     97     68    104      0     49     95     54     43     76
    149     62     54     66     53     34     19    166     83     28      6     48     20    152     49      0    142     15     91     27
     19     82     89     78    195    108    153     27     59    171    138    189    163     12     95    142      0    143     51    169
    152     67     54     70     51     40     10    168     84     34     10     45     28    154     54     15    143      0     93     26
     59     30     40     26    143     57    103     75     10    119     87    138    111     61     43     91     51     93      0    117
    177     90     79     93     26     62     16    193    109     15     30     20     16    179     76     27    169     26    117      0