# bench EOLE photo, generated by bep version 0.1, generation model "A"
bEpInstance_A_25_100
     25    100    100   1000     30     60     50    250    100    4.0
      1     31    285     37    185    385    147
      2     37     53     47    -47    153    244
      3     52    429     42    329    529     80
      4     59    632     49    532    732    132
      5     10    872     38    772    972    174
      6     67    358     36    258    458    157
      7     38    845     57    745    945    142
      8     65    773     45    673    873    244
      9      5    737     43    637    837    137
     10     79     20     42    -80    120    111
     11     45    812     44    712    912     57
     12     44     70     43    -30    170    160
     13     95    713     35    613    813    173
     14      7    380     34    280    480    141
     15     22     30     58    -70    130    225
     16     81    413     56    313    513    222
     17     15    291     39    191    391    239
     18     31    696     37    596    796    203
     19     51    703     54    603    803    241
     20     78    246     45    146    346    193
     21     96    672     40    572    772     55
     22      5    473     45    373    573    105
     23     50    400     34    300    500    111
     24     82    993     35    893   1093    243
     25     28    459     57    359    559    169
      0     58     36     87    146     20    140    122    113     67    131     53    108     24     63     34      4    102    104     15     98     47     29    177     43
     58      0     94    144    204     76    198    180    171     13    189      4    165     82      6     90     59    160    162     49    155    105     86    235    101
     36     94      0     50    111     18    104     86     77    102     95     89     71     16    100      8     35     66     68     46     61     16      7    141      9
     87    144     50      0     61     68     53     35     29    153     45    140     22     64    150     55     85     17     17     96     13     41     58     90     43
    146    204    111     61      0    129      9     28     33    213     17    200     45    123    210    116    145     44     43    157     54     99    118     35    103
     20     76     18     68    129      0    121    103     96     84    113     72     89     15     82     14     21     84     86     28     78     32     11    158     27
    140    198    104     53      9    121      0     19     28    206      8    193     35    116    203    108    138     37     35    150     45     93    111     38     96
    122    180     86     35     28    103     19      0     17    188     10    175     16     99    186     90    121     21     17    131     26     76     93     55     79
    113    171     77     29     33     96     28     17      0    180     21    167     23     89    176     83    111     12     14    124     27     66     84     66     69
     67     13    102    153    213     84    206    188    180      0    198     15    173     91     14     98     69    169    170     56    163    114     95    243    110
    131    189     95     45     17    113      8     10     21    198      0    185     27    108    195    100    130     29     27    141     37     85    103     46     88
     53      4     89    140    200     72    193    175    167     15    185      0    161     78     11     86     55    156    158     44    151    101     82    230     97
    108    165     71     22     45     89     35     16     23    173     27    161      0     86    171     75    107     16     11    116     10     64     79     70     65
     24     82     16     64    123     15    116     99     89     91    108     78     86      0     87     20     22     79     81     37     76     23     11    154     20
     63      6    100    150    210     82    203    186    176     14    195     11    171     87      0     96     65    166    168     55    161    110     92    241    107
     34     90      8     55    116     14    108     90     83     98    100     86     75     20     96      0     34     71     72     41     64     24      8    145     17
      4     59     35     85    145     21    138    121    111     69    130     55    107     22     65     34      0    101    103     19     97     45     28    176     42
    102    160     66     17     44     84     37     21     12    169     29    156     16     79    166     71    101      0      5    113     17     56     74     75     59
    104    162     68     17     43     86     35     17     14    170     27    158     11     81    168     72    103      5      0    114     13     58     75     72     61
     15     49     46     96    157     28    150    131    124     56    141     44    116     37     55     41     19    113    114      0    106     59     39    186     54
     98    155     61     13     54     78     45     26     27    163     37    151     10     76    161     64     97     17     13    106      0     54     68     80     55
     47    105     16     41     99     32     93     76     66    114     85    101     64     23    110     24     45     56     58     59     54      0     21    131      6
     29     86      7     58    118     11    111     93     84     95    103     82     79     11     92      8     28     74     75     39     68     21      0    148     15
    177    235    141     90     35    158     38     55     66    243     46    230     70    154    241    145    176     75     72    186     80    131    148      0    134
     43    101      9     43    103     27     96     79     69    110     88     97     65     20    107     17     42     59     61     54     55      6     15    134      0