# bench EOLE photo, generated by bep version 0.1, generation model "A"
bEpInstance_A_15_28
     15     28    100   1000     30     60     50    250    100    4.0
      1     52     44     44    -56    144    138
      2     12    157     32     57    257    196
      3      2    341     37    241    441    149
      4     70    408     52    308    508    216
      5      3    846     56    746    946    145
      6     97    961     33    861   1061    213
      7     36    843     38    743    943    229
      8    100    178     50     78    278    153
      9     22    100     59      0    200    120
     10     26     42     32    -58    142    106
     11     38    312     54    212    412     67
     12     72    496     58    396    596    202
     13     34    774     37    674    874    111
     14     74    345     33    245    445     68
     15     18    400     60    300    500     87
      0     29     75     91    200    229    199     35     15      6     67    113    182     75     89
     29      0     46     64    172    202    171     22     14     28     39     86    154     49     60
     75     46      0     23    126    156    125     47     60     74     11     42    108     18     15
     91     64     23      0    110    138    109     57     77     92     25     22     91     15     13
    200    172    126    110      0     37      8    168    186    201    133     89     19    126    111
    229    202    156    138     37      0     33    195    216    230    162    116     49    154    141
    199    171    125    109      8     33      0    167    185    200    132     87     17    124    110
     35     22     47     57    168    195    167      0     27     38     36     79    149     42     59
     15     14     60     77    186    216    185     27      0     14     53     99    168     62     75
      6     28     74     92    201    230    200     38     14      0     67    114    183     76     89
     67     39     11     25    133    162    132     36     53     67      0     46    115     12     22
    113     86     42     22     89    116     87     79     99    114     46      0     70     37     27
    182    154    108     91     19     49     17    149    168    183    115     70      0    107     93
     75     49     18     15    126    154    124     42     62     76     12     37    107      0     19
     89     60     15     13    111    141    110     59     75     89     22     27     93     19      0