# bench EOLE photo, generated by bep version 0.1, generation model "A"
bEpInstance_A_15_60
     15     60    100   1000     30     60     50    250    100    4.0
      1     99    265     34    165    365    187
      2      1    224     49    124    324     84
      3     30    551     31    451    651    186
      4      4    568     59    468    668    157
      5     85    807     46    707    907    182
      6     28    199     33     99    299     89
      7     21    186     45     86    286    181
      8     97    231     56    131    331    241
      9     50      8     49    -92    108    153
     10     23    274     51    174    374    157
     11     83    724     36    624    824    224
     12     29    167     42     67    267     78
     13     98    951     54    851   1051    101
     14     15    909     44    809   1009    122
     15      9    959     30    859   1059     62
      0     26     73     79    135     24     27      8     65     19    114     30    171    162    174
     26      0     82     86    147      9     10     24     55     13    126     15    183    171    183
     73     82      0      7     65     88     91     81    135     69     45     96    101     89    102
     79     86      7      0     63     92     95     87    140     73     43    100     98     85     97
    135    147     65     63      0    152    156    144    199    134     20    160     36     30     42
     24      9     88     92    152      0      3     19     48     18    131      8    188    177    190
     27     10     91     95    156      3      0     22     45     22    135      5    192    180    193
      8     24     81     87    144     19     22      0     56     21    123     23    180    170    183
     65     55    135    140    199     48     45     56      0     66    179     40    236    225    237
     19     13     69     73    134     18     22     21     66      0    113     26    170    158    171
    114    126     45     43     20    131    135    123    179    113      0    139     56     49     61
     30     15     96    100    160      8      5     23     40     26    139      0    196    185    198
    171    183    101     98     36    188    192    180    236    170     56    196      0     23     22
    162    171     89     85     30    177    180    170    225    158     49    185     23      0     12
    174    183    102     97     42    190    193    183    237    171     61    198     22     12      0