# bench EOLE photo, generated by bep version 0.1, generation model "A"
bEpInstance_A_10_48
     10     48    100   1000     30     60     50    250    100    4.0
      1     69    309     30    209    409    118
      2     81    575     39    475    675     76
      3     64     33     43    -67    133    198
      4     22    948     31    848   1048     53
      5     17    637     36    537    737    193
      6     42     44     50    -56    144    199
      7     96    433     45    333    533    211
      8     35    968     44    868   1068     57
      9     27    478     41    378    578     67
     10      5    683     36    583    783    188
      0     66     69    160     83     66     31    164     43     94
     66      0    135     94     22    133     35     98     27     33
     69    135      0    228    151      6    100    233    111    163
    160     94    228      0     77    226    130      5    117     66
     83     22    151     77      0    148     54     82     39     11
     66    133      6    226    148      0     98    231    108    160
     31     35    100    130     54     98      0    134     20     66
    164     98    233      5     82    231    134      0    122     71
     43     27    111    117     39    108     20    122      0     51
     94     33    163     66     11    160     66     71     51      0