# bench EOLE photo, generated by bep version 0.1, generation model "A"
bEpInstance_A_40_20
     40     20    100   1000     30     60     50    250    100    4.0
      1     15    740     46    640    840    126
      2     66    390     51    290    490    124
      3     58    662     34    562    762     90
      4     49    993     54    893   1093     79
      5      8    232     39    132    332     85
      6     38     22     60    -78    122    220
      7      1    503     33    403    603    114
      8     25    668     36    568    768    130
      9     41    746     54    646    846     62
     10     13    475     43    375    575    193
     11     13    587     58    487    687    175
     12     58    703     53    603    803    182
     13     94     85     56    -15    185    113
     14     10    826     35    726    926     75
     15     33    268     43    168    368    166
     16     94    662     60    562    762    118
     17     41    764     42    664    864    159
     18     24    839     37    739    939    125
     19     42    173     30     73    273     51
     20     88    775     50    675    875    212
     21     86    506     33    406    606    244
     22     33    292     32    192    392    182
     23     56    539     37    439    639    149
     24     20    224     56    124    324    172
     25     99    245     34    145    345     95
     26      8    410     48    310    510    152
     27     58    605     45    505    705    142
     28     38    181     38     81    281     98
     29     69    398     36    298    498     53
     30     69    298     51    198    398    100
     31     84    920     53    820   1020     57
     32     14    587     50    487    687     76
     33     84    799     41    699    899    234
     34     21    964     43    864   1064    209
     35     57    942     37    842   1042    240
     36     12    520     35    420    620    212
     37     92    392     55    292    492    172
     38     69    507     56    407    607    156
     39     43    608     47    508    708    164
     40     19    214     51    114    314     55
      0     88     22     63    127    179     59     18      6     66     38     14    164     21    118     27      8     24    141     20     61    112     51    129    125     82     35    139     86    111     48     38     22     56     51     55     89     59     33    131
     88      0     68    150     42     92     32     70     89     25     51     78     76    109     31     68     93    112     54     96     29     25     37     43     37     15     53     52      2     23    132     50    102    143    138     35      6     29     54     45
     22     68      0     82    108    160     42      8     21     48     21     10    144     42     98      9     25     45    122     29     39     92     30    109    104     64     14    120     66     91     64     21     34     76     70     37     68     38     14    112
     63    150     82      0    190    242    123     81     61    129    101     72    227     42    181     83     57     39    205     55    122    175    113    192    187    146     97    203    148    173     20    101     49     10     12    118    150    121     96    194
    127     42    108    190      0     53     67    109    128     60     88    118     42    148     10    109    133    151     17    137     71     16     77      3     22     44     94     14     44     22    173     88    143    183    177     72     45     70     94      5
    179     92    160    242     53      0    120    161    181    113    141    170     21    201     61    160    185    204     37    188    121     67    129     50     57     97    145     39     94     69    224    141    194    235    230    124     93    121    146     48
     59     32     42    123     67    120      0     41     61      7     21     51    107     80     59     46     66     84     83     71     21     53     16     69     68     23     29     81     31     53    106     21     76    115    110      5     35     17     28     72
     18     70      8     81    109    161     41      0     19     48     20     12    146     39    100     17     24     42    123     31     43     94     33    111    107     64     17    121     68     93     64     20     35     74     68     37     71     41     15    113
      6     89     21     61    128    181     61     19      0     68     40     11    165     21    119     24      4     23    143     13     61    113     51    130    126     84     35    141     87    112     44     40     17     54     49     56     89     60     34    133
     66     25     48    129     60    113      7     48     68      0     28     58     99     87     51     50     72     91     75     77     19     46     19     62     61     16     34     73     23     46    112     28     82    122    117     11     28     16     34     65
     38     51     21    101     88    141     21     20     40     28      0     31    127     59     79     27     44     63    103     50     27     73     16     90     88     44     12    101     49     73     85      0     55     94     89     16     52     24      9     93
     14     78     10     72    118    170     51     12     11     58     31      0    154     33    108     13     15     35    132     19     49    102     41    120    114     74     24    130     76    101     54     31     24     65     59     47     78     49     24    122
    164     76    144    227     42     21    107    146    165     99    127    154      0    186     48    144    170    189     25    172    105     53    113     39     40     84    130     27     78     53    208    127    178    220    214    110     76    105    131     37
     21    109     42     42    148    201     80     39     21     87     59     33    186      0    139     46     17      4    163     23     82    133     72    150    146    104     56    161    108    132     29     59     19     34     31     76    110     81     55    153
    118     31     98    181     10     61     59    100    119     51     79    108     48    139      0     99    124    142     23    127     60      6     67     11     17     36     84     21     33     11    163     79    133    174    168     63     34     60     85     13
     27     68      9     83    109    160     46     17     24     50     27     13    144     46     99      0     28     47    122     28     39     93     32    111    104     66     16    121     66     91     64     27     34     77     70     40     67     39     18    113
      8     93     25     57    133    185     66     24      4     72     44     15    170     17    124     28      0     19    147     12     65    118     56    135    130     88     39    145     91    116     40     44     13     50     44     61     93     64     39    137
     24    112     45     39    151    204     84     42     23     91     63     35    189      4    142     47     19      0    166     22     84    136     75    153    149    107     59    164    110    135     25     63     18     31     27     79    113     83     57    156
    141     54    122    205     17     37     83    123    143     75    103    132     25    163     23    122    147    166      0    150     83     29     91     13     22     59    108      2     56     31    187    103    156    197    192     87     56     83    108     11
     20     96     29     55    137    188     71     31     13     77     50     19    172     23    127     28     12     22    150      0     67    121     59    138    132     93     43    149     94    119     36     50      6     50     42     66     95     67     43    141
     61     29     39    122     71    121     21     43     61     19     27     49    105     82     60     39     65     84     83     67      0     55     11     72     65     30     25     82     27     52    103     27     73    115    109     18     28      4     27     74
    112     25     92    175     16     67     53     94    113     46     73    102     53    133      6     93    118    136     29    121     55      0     62     17     20     30     78     27     27      9    157     73    127    168    162     57     29     54     79     19
     51     37     30    113     77    129     16     33     51     19     16     41    113     72     67     32     56     75     91     59     11     62      0     79     74     34     16     89     35     60     95     15     65    106    100     11     37      8     17     81
    129     43    109    192      3     50     69    111    130     62     90    120     39    150     11    111    135    153     13    138     72     17     79      0     20     46     95     11     45     22    174     90    144    185    179     74     45     71     96      2
    125     37    104    187     22     57     68    107    126     61     88    114     40    146     17    104    130    149     22    132     65     20     74     20      0     47     90     22     38     15    168     88    138    180    174     72     36     65     91     21
     82     15     64    146     44     97     23     64     84     16     44     74     84    104     36     66     88    107     59     93     30     30     34     46     47      0     50     57     15     31    128     44     99    138    133     27     21     28     50     49
     35     53     14     97     94    145     29     17     35     34     12     24    130     56     84     16     39     59    108     43     25     78     16     95     90     50      0    106     51     76     79     11     48     90     84     24     53     24      3     98
    139     52    120    203     14     39     81    121    141     73    101    130     27    161     21    121    145    164      2    149     82     27     89     11     22     57    106      0     54     30    185    101    154    195    190     84     54     81    106      9
     86      2     66    148     44     94     31     68     87     23     49     76     78    108     33     66     91    110     56     94     27     27     35     45     38     15     51     54      0     25    130     49    100    142    136     33      5     27     52     47
    111     23     91    173     22     69     53     93    112     46     73    101     53    132     11     91    116    135     31    119     52      9     60     22     15     31     76     30     25      0    155     73    125    166    161     57     24     52     77     24
     48    132     64     20    173    224    106     64     44    112     85     54    208     29    163     64     40     25    187     36    103    157     95    174    168    128     79    185    130    155      0     85     30     19      8    101    132    103     78    177
     38     50     21    101     88    141     21     20     40     28      0     31    127     59     79     27     44     63    103     50     27     73     15     90     88     44     11    101     49     73     85      0     55     94     89     16     52     24      8     93
     22    102     34     49    143    194     76     35     17     82     55     24    178     19    133     34     13     18    156      6     73    127     65    144    138     99     48    154    100    125     30     55      0     44     36     72    101     73     48    147
     56    143     76     10    183    235    115     74     54    122     94     65    220     34    174     77     50     31    197     50    115    168    106    185    180    138     90    195    142    166     19     94     44      0     10    111    144    114     89    187
     51    138     70     12    177    230    110     68     49    117     89     59    214     31    168     70     44     27    192     42    109    162    100    179    174    133     84    190    136    161      8     89     36     10      0    106    137    108     83    182
     55     35     37    118     72    124      5     37     56     11     16     47    110     76     63     40     61     79     87     66     18     57     11     74     72     27     24     84     33     57    101     16     72    111    106      0     37     14     23     76
     89      6     68    150     45     93     35     71     89     28     52     78     76    110     34     67     93    113     56     95     28     29     37     45     36     21     53     54      5     24    132     52    101    144    137     37      0     29     55     48
     59     29     38    121     70    121     17     41     60     16     24     49    105     81     60     39     64     83     83     67      4     54      8     71     65     28     24     81     27     52    103     24     73    114    108     14     29      0     26     74
     33     54     14     96     94    146     28     15     34     34      9     24    131     55     85     18     39     57    108     43     27     79     17     96     91     50      3    106     52     77     78      8     48     89     83     23     55     26      0     98
    131     45    112    194      5     48     72    113    133     65     93    122     37    153     13    113    137    156     11    141     74     19     81      2     21     49     98      9     47     24    177     93    147    187    182     76     48     74     98      0