# bench EOLE photo, generated by bep version 0.1, generation model "A"
bEpInstance_A_25_58
     25     58    100   1000     30     60     50    250    100    4.0
      1     77    938     30    838   1038     58
      2     65    781     58    681    881    166
      3     18    878     30    778    978    120
      4     23    462     44    362    562    173
      5     48    775     34    675    875    216
      6     64     83     36    -17    183    241
      7     75    221     32    121    321    100
      8     27    597     33    497    697     57
      9     53    157     32     57    257     86
     10     94    994     53    894   1094     75
     11     88    780     44    680    880     71
     12     24    947     52    847   1047    195
     13     72    875     47    775    975    121
     14     96    753     39    653    853    191
     15     98    384     59    284    484     99
     16     99     81     38    -19    181    153
     17     24    368     51    268    468     85
     18     36    465     39    365    565     97
     19     24    781     40    681    881    147
     20     73     62     36    -38    162    140
     21     94    769     54    669    869    229
     22     52    111     48     11    211    149
     23     50    553     52    453    653    145
     24     64     27     60    -73    127    225
     25     39    694     31    594    794    202
      0     39     21    119     41    213    179     86    195     14     39     13     15     46    138    214    143    118     41    219     42    206     96    227     61
     39      0     26     80      4    174    140     46    156     53      5     42     23     10     99    175    103     79     10    179      7    167     57    188     22
     21     26      0    104     26    199    164     70    180     34     30     17     13     36    125    200    127    103     24    204     33    191     81    213     46
    119     80    104      0     78     95     61     33     76    134     81    121    103     75     27     97     23      3     79    100     78     88     23    109     58
     41      4     26     78      0    173    138     44    154     55     10     43     25     13     98    173    101     77      6    178     11    166     55    187     20
    213    174    199     95    173      0     34    128     18    227    174    216    198    167     75      8     71     95    174      5    171      7    117     14    152
    179    140    164     61    138     34      0     94     16    193    139    181    163    133     41     35     38     61    140     39    137     28     83     48    118
     86     46     70     33     44    128     94      0    110    100     48     87     70     42     56    130     57     33     46    134     46    121     12    142     24
    195    156    180     76    154     18     16    110      0    209    155    197    179    149     57     22     53     77    156     24    153     11     99     32    134
     14     53     34    134     55    227    193    100    209      0     53     21     30     60    152    228    157    133     56    233     56    220    110    241     76
     39      5     30     81     10    174    139     48    155     53      0     44     24      7     99    174    104     79     16    179      3    167     57    188     24
     13     42     17    121     43    216    181     87    197     21     44      0     21     51    141    217    144    120     41    221     47    209     98    230     63
     15     23     13    103     25    198    163     70    179     30     24     21      0     31    122    198    127    102     26    203     27    191     80    212     45
     46     10     36     75     13    167    133     42    149     60      7     51     31      0     92    168     97     73     19    172      4    160     51    181     20
    138     99    125     27     98     75     41     56     57    152     99    141    122     92      0     75     18     25    100     80     96     69     43     89     78
    214    175    200     97    173      8     35    130     22    228    174    217    198    168     75      0     74     97    176      8    172     13    118     16    153
    143    103    127     23    101     71     38     57     53    157    104    144    127     97     18     74      0     24    103     77    101     64     46     85     81
    118     79    103      3     77     95     61     33     77    133     79    120    102     73     25     97     24      0     79    101     77     88     22    109     57
     41     10     24     79      6    174    140     46    156     56     16     41     26     19    100    176    103     79      0    180     17    167     57    188     22
    219    179    204    100    178      5     39    134     24    233    179    221    203    172     80      8     77    101    180      0    176     13    122      9    158
     42      7     33     78     11    171    137     46    153     56      3     47     27      4     96    172    101     77     17    176      0    164     55    185     23
    206    167    191     88    166      7     28    121     11    220    167    209    191    160     69     13     64     88    167     13    164      0    110     21    145
     96     57     81     23     55    117     83     12     99    110     57     98     80     51     43    118     46     22     57    122     55    110      0    131     35
    227    188    213    109    187     14     48    142     32    241    188    230    212    181     89     16     85    109    188      9    185     21    131      0    166
     61     22     46     58     20    152    118     24    134     76     24     63     45     20     78    153     81     57     22    158     23    145     35    166      0