# bench EOLE photo, generated by bep version 0.1, generation model "A"
bEpInstance_A_15_5
     15      5    100   1000     30     60     50    250    100    4.0
      1     27     46     60    -54    146     66
      2     14     79     38    -21    179    140
      3     50    894     30    794    994    105
      4     98    221     42    121    321    101
      5     36    272     42    172    372    101
      6     30    461     43    361    561    107
      7      7    822     59    722    922    128
      8     37    970     44    870   1070    180
      9      1    470     52    370    570     82
     10     55      8     48    -92    108     59
     11     91    628     40    528    728    225
     12     85    739     34    639    839     92
     13      1    547     44    447    647    113
     14      0    921     48    821   1021     66
     15     74    565     44    465    665     73
      0      8    212     47     56    103    194    231    106     11    146    173    125    218    130
      8      0    203     41     48     95    185    222     97     20    138    165    117    210    122
    212    203      0    168    155    108     20     19    106    221     67     39     87     14     82
     47     41    168      0     20     62    151    187     66     54    101    129     85    176     86
     56     48    155     20      0     47    137    174     50     66     90    117     69    162     73
    103     95    108     62     47      0     90    127      7    113     44     70     22    115     28
    194    185     20    151    137     90      0     37     88    203     52     28     68     24     66
    231    222     19    187    174    127     37      0    125    240     86     58    106     15    101
    106     97    106     66     50      7     88    125      0    116     45     70     19    112     29
     11     20    221     54     66    113    203    240    116      0    155    182    135    228    139
    146    138     67    101     90     44     52     86     45    155      0     27     30     76     16
    173    165     39    129    117     70     28     58     70    182     27      0     52     50     43
    125    117     87     85     69     22     68    106     19    135     30     52      0     93     18
    218    210     14    176    162    115     24     15    112    228     76     50     93      0     90
    130    122     82     86     73     28     66    101     29    139     16     43     18     90      0