48
8 9 5 4 9 8 8 4 4 8 9 10 9 9 10 7 9 7 8 10 67 7 9 7 20 7 6 6 6 3 5 9 2 8 11 6 6 6 5 9 6 10 10 5 7 3 10 10
4 6 28 5 3
2 19 23
3 24 23 22
3 20 27 3
1 21
2 40 47
4 19 24 20 17
3 24 23 22
3 24 23 22
1 44
0
0
1 10
0
2 14 13
2 12 11
1 21
2 16 15
4 18 20 28 17
2 48 40
0
1 21
3 20 27 19
3 20 28 19
3 24 23 22
1 32
1 26
2 44 26
2 28 27
1 31
0
0
0
2 32 39
2 31 32
2 32 30
2 36 35
3 32 39 33
0
3 36 35 34
2 38 33
2 41 40
3 39 38 37
0
1 44
0
2 43 42
3 47 46 45
/* Probabilities */
17280
0.49745 0.183282 0.147185 0.0945905 0.0486951 0.019998 0.00659934 0.00219978
0.676132 0.148485 0.0959904 0.049695 0.0205979 0.00679932 0.00179982 4.9995E-4
0.7781 0.1148 0.0642 0.0288 0.0103 0.0030 7.0E-4 1.0E-4
0.8444 0.0873 0.0435 0.0174 0.0056 0.0014 3.0E-4 1.0E-4
0.878324 0.0713857 0.0330934 0.0122975 0.00369926 8.9982E-4 1.9996E-4 9.998E-5
0.3521 0.1864 0.1781 0.1363 0.0835 0.0409 0.0161 0.0066
0.5333 0.1789 0.1377 0.0849 0.0419 0.0165 0.0052 0.0016
0.6527 0.1548 0.1032 0.055 0.0235 0.0080 0.0022 6.0E-4
0.7388 0.129 0.0766 0.0364 0.0138 0.0042 0.0010 2.0E-4
0.786479 0.111611 0.0616062 0.0273027 0.00960096 0.00270027 6.0006E-4 1.0001E-4
0.225723 0.165217 0.188119 0.171317 0.124912 0.0729073 0.0341034 0.0177018
0.386039 0.187919 0.172317 0.126413 0.0742074 0.0349035 0.0131013 0.00510051
0.5076 0.1822 0.1445 0.0918 0.0467 0.019 0.0062 0.0020
0.605 0.1661 0.1174 0.0664 0.0301 0.0109 0.0032 9.0E-4
0.663 0.1521 0.1 0.0527 0.0222 0.0075 0.0020 5.0E-4
0.13 0.1278 0.1732 0.1878 0.1631 0.1133 0.0631 0.0417
0.253675 0.172183 0.187981 0.164184 0.114789 0.0642936 0.0287971 0.0140986
0.361564 0.186981 0.176582 0.133487 0.0807919 0.0391961 0.0151985 0.00619938
0.457354 0.186581 0.157084 0.105789 0.0570943 0.0245975 0.00849915 0.0029997
0.518952 0.180818 0.141614 0.0887089 0.0445045 0.0179018 0.00570057 0.00180018
0.0668933 0.0861914 0.139086 0.179582 0.185581 0.153585 0.10179 0.0872913
0.149985 0.137686 0.178882 0.185981 0.154885 0.10319 0.0550945 0.0342966
0.2335 0.1673 0.1882 0.1694 0.1221 0.0704 0.0325 0.0166
0.3155 0.1828 0.1832 0.147 0.0944 0.0485 0.0199 0.0087
0.372163 0.187481 0.174783 0.130387 0.0778922 0.0372963 0.0142986 0.00569943
0.0305031 0.0507051 0.0974097 0.149715 0.184318 0.181618 0.143214 0.162516
0.0793 0.096 0.1484 0.1838 0.1822 0.1446 0.0918 0.0739
0.1355 0.1306 0.1749 0.1875 0.1608 0.1105 0.0607 0.0395
0.19658 0.156284 0.186381 0.177982 0.136086 0.0832917 0.0407959 0.0225977
0.242176 0.169483 0.188181 0.167183 0.118888 0.0676932 0.0308969 0.0154985
0.0123 0.026 0.0595 0.1089 0.1596 0.1872 0.1758 0.2707
0.0373 0.0583 0.1075 0.1584 0.1869 0.1766 0.1336 0.1414
0.070207 0.0889089 0.141814 0.180918 0.184818 0.151115 0.0989099 0.0833083
0.1099 0.1165 0.1654 0.1881 0.1712 0.1247 0.0727 0.0515
0.1417 0.1337 0.1767 0.1869 0.1583 0.1073 0.0582 0.0372
0.00440044 0.0116012 0.0317032 0.0691069 0.120512 0.168317 0.188219 0.406141
0.0155016 0.0309031 0.0678068 0.119112 0.167317 0.188219 0.169417 0.241724
0.0323032 0.0528053 0.10021 0.152315 0.185219 0.180318 0.140514 0.156316
0.0548 0.0757 0.128 0.1733 0.1878 0.1629 0.1131 0.1044
0.0740926 0.0919908 0.144686 0.182282 0.183782 0.148285 0.0957904 0.0790921
0.00140014 0.00450045 0.0147015 0.0382038 0.0794079 0.132013 0.175718 0.554055
0.00569943 0.0142986 0.0372963 0.0780922 0.130587 0.174883 0.187481 0.371663
0.0132 0.0273 0.0618 0.1118 0.1619 0.1876 0.1741 0.2623
0.0242 0.0429 0.0864 0.1393 0.1797 0.1856 0.1534 0.1885
0.0343966 0.0551945 0.10339 0.154985 0.186081 0.178782 0.137486 0.149685
0.3899 0.188 0.1715 0.1253 0.0732 0.0343 0.0128 0.0050
0.5274 0.1797 0.1393 0.0865 0.0429 0.0171 0.0054 0.0017
0.6182 0.1632 0.1135 0.0632 0.0282 0.01 0.0029 8.0E-4
0.686769 0.145415 0.0928093 0.0473047 0.0193019 0.00630063 0.00170017 4.0004E-4
0.726527 0.132987 0.080392 0.0388961 0.0149985 0.00469953 0.00119988 2.9997E-4
0.2569 0.173 0.1878 0.1633 0.1137 0.0633 0.0282 0.0138
0.3803 0.1878 0.1733 0.1281 0.0757 0.0359 0.0136 0.0053
0.471053 0.185681 0.153785 0.10189 0.0540946 0.0229977 0.00779922 0.00269973
0.5451 0.1771 0.1345 0.0817 0.0398 0.0155 0.0048 0.0015
0.590641 0.169083 0.121588 0.069993 0.0322968 0.0118988 0.00349965 9.999E-4
0.1524 0.1387 0.1794 0.1857 0.1539 0.1021 0.0542 0.0336
0.2489 0.1711 0.1881 0.1654 0.1165 0.0657 0.0296 0.0147
0.3279 0.1842 0.1817 0.1434 0.0906 0.0458 0.0185 0.0079
0.39736 0.188081 0.170083 0.123088 0.0712929 0.0330967 0.0122988 0.00469953
0.4428 0.1874 0.1604 0.11 0.0603 0.0265 0.0093 0.0033
0.0808 0.0971 0.1495 0.1842 0.1817 0.1435 0.0907 0.0725
0.1465 0.136 0.178 0.1864 0.1563 0.1049 0.0564 0.0355
0.206279 0.159484 0.187181 0.175882 0.132287 0.079692 0.0383962 0.0207979
0.2632 0.1743 0.1876 0.1616 0.1115 0.0615 0.0272 0.0131
0.30253 0.181118 0.184618 0.150715 0.0984098 0.0515052 0.0215022 0.00960096
0.0381 0.0592 0.1086 0.1593 0.1872 0.176 0.1325 0.1391
0.0771 0.0943 0.1469 0.1832 0.1829 0.1461 0.0935 0.076
0.116512 0.120412 0.168217 0.188219 0.168517 0.120812 0.0693069 0.0480048
0.157 0.1408 0.1805 0.1851 0.152 0.0999 0.0526 0.0321
0.186581 0.152685 0.185281 0.180082 0.140086 0.0871913 0.0434957 0.0245975
0.0159 0.0315 0.0688 0.1202 0.1681 0.1882 0.1687 0.2386
0.0361 0.057 0.1058 0.157 0.1866 0.1775 0.1352 0.1448
0.0587 0.0792 0.1319 0.1756 0.1873 0.1598 0.1092 0.0983
0.0838 0.0992 0.1514 0.1849 0.1808 0.1415 0.0886 0.0698
0.1031 0.1123 0.1623 0.1877 0.1738 0.1288 0.0764 0.0556
0.0059 0.0146 0.038 0.0791 0.1317 0.1755 0.1873 0.3679
0.0149985 0.030097 0.0663934 0.117388 0.166083 0.188081 0.170583 0.246375
0.0262026 0.0455046 0.090109 0.142914 0.181518 0.184418 0.150015 0.179318
0.039796 0.0609939 0.110789 0.161084 0.187481 0.174683 0.130287 0.134887
0.0508 0.072 0.1239 0.1706 0.1881 0.166 0.1173 0.1113
0.0019 0.0059 0.0183 0.0454 0.09 0.1428 0.1814 0.5143
0.00549945 0.0137986 0.0363964 0.0764924 0.128887 0.173883 0.187681 0.377362
0.010399 0.0227977 0.0536946 0.10149 0.153385 0.185581 0.179682 0.292971
0.0167 0.0327 0.0707 0.1224 0.1696 0.1882 0.1671 0.2326
0.0222 0.0403 0.0825 0.1353 0.1776 0.1866 0.1569 0.1986
5.0005E-4 0.00210021 0.00770077 0.0227023 0.0536054 0.10131 0.153215 0.658866
0.0018 0.0055 0.0174 0.0435 0.0873 0.1401 0.1801 0.5243
0.00360072 0.00990198 0.0279056 0.0628126 0.113023 0.162833 0.187838 0.432086
0.0062 0.0153 0.0394 0.0811 0.1338 0.1768 0.1869 0.3605
0.00859914 0.019598 0.0478952 0.0935906 0.146185 0.182882 0.183182 0.318068
0.3174 0.1831 0.183 0.1464 0.0937 0.0481 0.0197 0.0086
0.417342 0.188119 0.166017 0.117312 0.0663066 0.030003 0.0109011 0.0040004
0.4875 0.1843 0.1497 0.0973 0.0507 0.0211 0.0070 0.0024
0.544 0.1773 0.1348 0.082 0.0399 0.0156 0.0049 0.0015
0.579058 0.171317 0.125013 0.0729073 0.0341034 0.0127013 0.00380038 0.00110011
0.19818 0.156784 0.186481 0.177682 0.135486 0.0826917 0.040396 0.0222978
0.280244 0.177564 0.186563 0.156869 0.105679 0.0569886 0.0245951 0.0114977
0.342934 0.185619 0.179518 0.139014 0.0861086 0.0427043 0.0170017 0.00710071
0.39644 0.188119 0.170317 0.123412 0.0715072 0.0332033 0.0123012 0.00470047
0.4309 0.1878 0.1631 0.1134 0.0631 0.0281 0.01 0.0036
0.110889 0.117088 0.165883 0.188081 0.170783 0.124088 0.0721928 0.0509949
0.1697 0.1462 0.1829 0.1832 0.1468 0.0942 0.0484 0.0286
0.218322 0.163116 0.187819 0.173117 0.127713 0.0754075 0.0357036 0.0188019
0.2624 0.1741 0.1876 0.1618 0.1118 0.0618 0.0273 0.0132
0.2921 0.1796 0.1856 0.1536 0.1018 0.054 0.0229 0.0104
0.0554 0.0763 0.1286 0.1737 0.1877 0.1624 0.1125 0.1034
0.092 0.105 0.1564 0.1864 0.1779 0.136 0.0831 0.0632
0.124788 0.124988 0.171383 0.188081 0.165183 0.116188 0.0653935 0.0439956
0.1564 0.1406 0.1803 0.1852 0.1522 0.1002 0.0528 0.0323
0.178618 0.149715 0.184318 0.181618 0.143214 0.090409 0.0457046 0.0264026
0.0245 0.0433 0.087 0.1399 0.18 0.1854 0.1529 0.187
0.0444 0.0657 0.1166 0.1655 0.1881 0.1711 0.1246 0.124
0.0636936 0.0834917 0.136386 0.178182 0.186281 0.155984 0.10459 0.0913909
0.0834 0.099 0.1511 0.1848 0.1809 0.1417 0.0889 0.0702
0.0978098 0.108911 0.159616 0.187219 0.175818 0.132113 0.079508 0.0590059
0.0096 0.0215 0.0513 0.0982 0.1505 0.1846 0.1812 0.3031
0.0189981 0.0358964 0.0757924 0.128187 0.173383 0.187781 0.162784 0.217178
0.0288058 0.0487097 0.0946189 0.147229 0.183337 0.182737 0.145829 0.168734
0.0394961 0.0607939 0.110489 0.160884 0.187481 0.174883 0.130587 0.135386
0.0477 0.0691 0.1205 0.1683 0.1882 0.1684 0.1207 0.1171
0.0033 0.0093 0.0264 0.0602 0.1098 0.1603 0.1873 0.4434
0.00720072 0.0171017 0.0430043 0.0865087 0.139414 0.179718 0.185519 0.341534
0.0115977 0.024795 0.0572885 0.106079 0.157269 0.186663 0.177365 0.278944
0.0166 0.0325 0.0705 0.1221 0.1694 0.1882 0.1673 0.2334
0.0206021 0.0382038 0.0794079 0.132013 0.175718 0.187219 0.159716 0.207121
0.0010001 0.00350035 0.0118012 0.0321032 0.069807 0.121412 0.168917 0.591459
0.00239976 0.00709929 0.0212979 0.0509949 0.0977902 0.150085 0.184382 0.485951
0.0041 0.011 0.0302 0.0667 0.1177 0.1663 0.1881 0.4159
0.0062 0.0152 0.0392 0.0808 0.1336 0.1766 0.1869 0.3615
0.0079 0.0184 0.0456 0.0903 0.1431 0.1815 0.1844 0.3288
3.0003E-4 0.00110011 0.00460046 0.0150015 0.0387039 0.080208 0.132813 0.727273
6.9993E-4 0.00259974 0.00919908 0.0261974 0.059794 0.109289 0.159884 0.632337
0.0013 0.0042 0.0139 0.0366 0.0768 0.1292 0.1741 0.5639
0.0020 0.0062 0.019 0.0467 0.0918 0.1446 0.1822 0.5075
0.00269973 0.00779922 0.0227977 0.0538946 0.10159 0.153485 0.185581 0.472153
0.263974 0.174483 0.187581 0.161384 0.111189 0.0612939 0.0270973 0.0129987
0.3334 0.1848 0.1809 0.1418 0.0889 0.0447 0.0179 0.0076
0.383162 0.187881 0.172783 0.127187 0.0749925 0.0353965 0.0133987 0.00519948
0.424558 0.187981 0.164484 0.115188 0.0645935 0.0289971 0.010399 0.00379962
0.4509 0.187 0.1586 0.1076 0.0585 0.0254 0.0089 0.0031
0.157584 0.141086 0.180582 0.184982 0.151785 0.09959 0.0523948 0.0319968
0.2107 0.1608 0.1875 0.1749 0.1306 0.0781 0.0374 0.02
0.251325 0.171717 0.188019 0.164816 0.115612 0.0649065 0.0292029 0.0144014
0.286571 0.178682 0.186081 0.155184 0.10359 0.0552945 0.0236976 0.0108989
0.309731 0.182118 0.183918 0.148615 0.0961096 0.049805 0.0206021 0.00910091
0.0841084 0.09951 0.151615 0.185019 0.180618 0.141214 0.0884088 0.069507
0.1195 0.1221 0.1694 0.1882 0.1673 0.1191 0.0679 0.0465
0.1483 0.1369 0.1784 0.1862 0.1556 0.104 0.0557 0.0349
0.174417 0.148115 0.183718 0.182318 0.144914 0.0922092 0.0469047 0.0274027
0.1922 0.1547 0.186 0.1789 0.1378 0.085 0.0419 0.0235
0.04 0.0612 0.1111 0.1613 0.1875 0.1745 0.13 0.1344
0.0605 0.0808 0.1335 0.1766 0.187 0.1584 0.1075 0.0957
0.0782078 0.0952095 0.147715 0.183518 0.182518 0.145315 0.0926093 0.0749075
0.0951 0.1071 0.1581 0.1869 0.1768 0.1339 0.0812 0.0609
0.1069 0.1146 0.164 0.1879 0.1724 0.1265 0.0744 0.0533
0.0168 0.0328 0.0709 0.1227 0.1698 0.1882 0.1669 0.2319
0.0271973 0.0466953 0.0917908 0.144486 0.182182 0.183782 0.148485 0.175382
0.0367 0.0577 0.1066 0.1577 0.1868 0.1771 0.1344 0.143
0.0461 0.0675 0.1187 0.167 0.1882 0.1697 0.1225 0.1203
0.053 0.0741 0.1262 0.1721 0.188 0.1643 0.1149 0.1074
0.0062 0.0154 0.0395 0.0814 0.1341 0.1769 0.1868 0.3597
0.0108 0.0235 0.055 0.1032 0.1548 0.186 0.1789 0.2878
0.0152015 0.0305031 0.0671067 0.118212 0.166717 0.188219 0.170017 0.244024
0.019898 0.0370963 0.0776922 0.130187 0.174683 0.187481 0.161184 0.211779
0.0233023 0.0417042 0.0847085 0.137514 0.178818 0.186019 0.155016 0.192919
0.0019998 0.00629937 0.0191981 0.0470953 0.0923908 0.145085 0.182382 0.505549
0.0038 0.0103 0.0288 0.0642 0.1148 0.1642 0.1879 0.426
0.00559944 0.0140986 0.0368963 0.0772923 0.129787 0.174383 0.187581 0.374363
0.00750075 0.0178018 0.0444044 0.0885089 0.141414 0.180718 0.184918 0.334733
0.00909909 0.020498 0.049595 0.0957904 0.148285 0.183782 0.182282 0.310669
6.0006E-4 0.00220022 0.00810081 0.0237024 0.0555056 0.10381 0.155316 0.650765
0.00120012 0.00390039 0.0131013 0.0349035 0.0742074 0.126313 0.172217 0.574157
0.00179982 0.00569943 0.0176982 0.0440956 0.0880912 0.140986 0.180482 0.521148
0.00250025 0.00740074 0.0221022 0.0525053 0.09981 0.151915 0.185119 0.478648
0.0031 0.0088 0.0253 0.0582 0.1073 0.1583 0.1869 0.4521
1.0E-4 7.0E-4 0.0030 0.0104 0.0291 0.0647 0.1154 0.7766
3.0003E-4 0.00130013 0.00520052 0.0165017 0.0418042 0.0848085 0.137714 0.712371
4.9995E-4 0.0019998 0.00739926 0.0218978 0.0521948 0.0993901 0.151485 0.665133
6.9993E-4 0.00269973 0.00959904 0.0271973 0.0614939 0.111389 0.161584 0.625337
9.0E-4 0.0033 0.0113 0.0309 0.0677 0.1189 0.1672 0.5998
0.4008 0.1882 0.1694 0.1221 0.0704 0.0325 0.012 0.0046
0.4536 0.1868 0.1579 0.1069 0.0579 0.0251 0.0087 0.0031
0.489349 0.184118 0.149215 0.0968097 0.050305 0.0209021 0.0070007 0.00230023
0.517948 0.180882 0.141786 0.0889911 0.0446955 0.0179982 0.00579942 0.00189981
0.5359 0.1785 0.137 0.0842 0.0414 0.0163 0.0051 0.0016
0.2661 0.1749 0.1875 0.1608 0.1105 0.0607 0.0267 0.0128
0.312131 0.182418 0.183618 0.147915 0.0954095 0.0492049 0.020302 0.0090009
0.3445 0.1858 0.1793 0.1385 0.0857 0.0424 0.0168 0.0070
0.371437 0.187419 0.174917 0.130713 0.0781078 0.0374037 0.0143014 0.00570057
0.3885 0.188 0.1718 0.1257 0.0736 0.0345 0.0129 0.0050
0.1592 0.1418 0.1809 0.1848 0.1511 0.0989 0.0518 0.0315
0.193961 0.155369 0.186163 0.178564 0.137073 0.0842831 0.0414917 0.0230954
0.2196 0.1635 0.1879 0.1728 0.1272 0.075 0.0354 0.0186
0.241452 0.169366 0.188162 0.167367 0.119176 0.0678864 0.0309938 0.0155969
0.2557 0.1727 0.1879 0.1636 0.1141 0.0637 0.0284 0.0139
0.0851 0.1002 0.1523 0.1852 0.1803 0.1405 0.0877 0.0687
0.108089 0.115388 0.164584 0.187981 0.171883 0.125787 0.0736926 0.0525947
0.1257 0.1255 0.1717 0.188 0.1648 0.1157 0.065 0.0436
0.141186 0.133487 0.176582 0.186981 0.158484 0.107489 0.0583942 0.0373963
0.151515 0.138314 0.179218 0.185819 0.154315 0.10251 0.0545055 0.0338034
0.0405 0.0618 0.1118 0.1619 0.1876 0.1741 0.1293 0.133
0.0537 0.0747 0.127 0.1726 0.1879 0.1637 0.1142 0.1062
0.0642 0.084 0.1369 0.1784 0.1862 0.1556 0.1041 0.0906
0.0738 0.0917 0.1445 0.1822 0.1838 0.1485 0.0961 0.0794
0.080292 0.0966903 0.149085 0.184082 0.181882 0.143886 0.0910909 0.0729927
0.0171 0.0332 0.0716 0.1234 0.1703 0.1881 0.1664 0.2299
0.0236976 0.0421958 0.0853915 0.138286 0.179182 0.185881 0.154285 0.191081
0.0292 0.0491 0.0951 0.1477 0.1835 0.1825 0.1453 0.1676
0.0343 0.055 0.1031 0.1548 0.186 0.1789 0.1377 0.1502
0.0377962 0.0588941 0.108189 0.158984 0.187081 0.176182 0.132887 0.139986
0.0064 0.0156 0.04 0.082 0.1348 0.1773 0.1867 0.3572
0.00920092 0.0208021 0.050105 0.0966097 0.149015 0.184018 0.181918 0.308331
0.0116988 0.0249975 0.0576942 0.106589 0.157684 0.186781 0.177082 0.277472
0.0141014 0.0287029 0.0642064 0.114711 0.164116 0.187919 0.172317 0.253925
0.0158016 0.0313031 0.0684068 0.119812 0.167817 0.188219 0.168917 0.239724
0.00209979 0.00639936 0.0194981 0.0475952 0.0930907 0.145685 0.182682 0.50295
0.0032 0.0089 0.0256 0.0588 0.1081 0.1589 0.1871 0.4494
0.0041 0.0111 0.0305 0.0671 0.1182 0.1667 0.1882 0.4141
0.00510051 0.0131013 0.0348035 0.0741074 0.126313 0.172217 0.188019 0.386339
0.0058 0.0145 0.0378 0.0787 0.1313 0.1753 0.1873 0.3693
5.9994E-4 0.00229977 0.00829917 0.0240976 0.0559944 0.10449 0.155984 0.648235
0.0010 0.0033 0.0114 0.0313 0.0684 0.1197 0.1677 0.5972
0.00129974 0.00429914 0.0140972 0.0368926 0.0772845 0.129774 0.174365 0.561988
0.00160016 0.00520052 0.0165017 0.0418042 0.0848085 0.137614 0.178818 0.533653
0.00189981 0.00589941 0.0181982 0.0450955 0.089591 0.142386 0.181182 0.515748
0.746225 0.126387 0.0741926 0.0348965 0.0130987 0.0039996 9.999E-4 1.9998E-4
0.7578 0.1223 0.0706 0.0326 0.0121 0.0036 8.0E-4 2.0E-4
0.7652 0.1196 0.0683 0.0312 0.0114 0.0033 8.0E-4 2.0E-4
0.7711 0.1174 0.0664 0.0301 0.0109 0.0032 7.0E-4 2.0E-4
0.7747 0.116 0.0653 0.0294 0.0106 0.0031 7.0E-4 2.0E-4
0.613939 0.164184 0.114789 0.0641936 0.0287971 0.010299 0.0029997 7.9992E-4
0.6277 0.161 0.1107 0.0609 0.0268 0.0095 0.0027 7.0E-4
0.6368 0.1588 0.108 0.0587 0.0256 0.0089 0.0025 7.0E-4
0.644064 0.157016 0.105811 0.0570057 0.0246025 0.00850085 0.00240024 6.0006E-4
0.6485 0.1559 0.1044 0.056 0.024 0.0083 0.0023 6.0E-4
0.4667 0.186 0.1548 0.1032 0.055 0.0235 0.0080 0.0028
0.4811 0.1849 0.1513 0.0991 0.052 0.0218 0.0073 0.0025
0.490651 0.183982 0.148885 0.0964904 0.049995 0.0207979 0.00689931 0.00229977
0.49835 0.183218 0.146915 0.0943094 0.0485049 0.019902 0.00660066 0.00220022
0.5032 0.1827 0.1457 0.093 0.0475 0.0194 0.0064 0.0021
0.3238 0.1838 0.1822 0.1445 0.0918 0.0467 0.019 0.0082
0.336934 0.185119 0.180418 0.140714 0.0879088 0.0439044 0.0176018 0.00740074
0.345765 0.185881 0.179082 0.138186 0.0852915 0.0421958 0.0166983 0.00689931
0.352865 0.186381 0.177982 0.136086 0.0832917 0.0407959 0.0159984 0.00659934
0.357364 0.186681 0.177282 0.134787 0.0819918 0.039896 0.0155984 0.00639936
0.2032 0.1584 0.187 0.1766 0.1335 0.0808 0.0392 0.0213
0.213521 0.161716 0.187619 0.174217 0.129513 0.0771077 0.0367037 0.019602
0.220578 0.163784 0.187881 0.172583 0.126887 0.0746925 0.0351965 0.0183982
0.2264 0.1654 0.1881 0.1712 0.1247 0.0727 0.0339 0.0176
0.230023 0.166417 0.188119 0.170317 0.123312 0.0715072 0.0332033 0.0171017
0.1144 0.1191 0.1673 0.1882 0.1694 0.1221 0.0704 0.0491
0.121512 0.123212 0.170217 0.188119 0.166517 0.118012 0.0669067 0.0455046
0.1264 0.1259 0.1719 0.188 0.1645 0.1153 0.0647 0.0433
0.1305 0.128 0.1733 0.1878 0.1629 0.1131 0.0629 0.0415
0.133013 0.129413 0.174117 0.187619 0.161816 0.111711 0.0618062 0.0405041
0.0574 0.0781 0.1306 0.1749 0.1875 0.1608 0.1105 0.1002
0.0617062 0.0818082 0.134613 0.177218 0.186719 0.157516 0.106411 0.0940094
0.0646935 0.0843916 0.137186 0.178582 0.186081 0.155284 0.10369 0.090091
0.0671 0.0864 0.1393 0.1797 0.1856 0.1534 0.1015 0.087
0.0687 0.0877 0.1406 0.1803 0.1852 0.1522 0.1002 0.0851
0.0255974 0.0446955 0.0888911 0.141786 0.180882 0.184782 0.151085 0.182282
0.0278 0.0474 0.0929 0.1455 0.1826 0.1834 0.1475 0.1729
0.0294 0.0493 0.0955 0.148 0.1836 0.1824 0.145 0.1668
0.0306969 0.0508949 0.0975902 0.149985 0.184382 0.181482 0.142986 0.161984
0.0315 0.0519 0.099 0.1512 0.1848 0.1809 0.1417 0.159
0.0101 0.0223 0.0528 0.1002 0.1523 0.1852 0.1803 0.2968
0.0110978 0.0239952 0.0558888 0.104279 0.155769 0.186263 0.178264 0.284443
0.0118 0.0251 0.058 0.107 0.158 0.1869 0.1769 0.2763
0.0124 0.0261 0.0597 0.1092 0.1598 0.1872 0.1757 0.2699
0.0127987 0.0266973 0.0607939 0.110489 0.160884 0.187481 0.174883 0.265973
0.349635 0.186219 0.178518 0.137014 0.0842084 0.0414041 0.0163016 0.00670067
0.5307 0.1792 0.1384 0.0856 0.0423 0.0168 0.0053 0.0017
0.6502 0.1555 0.1039 0.0556 0.0238 0.0082 0.0022 6.0E-4
0.736747 0.129726 0.0772154 0.0368074 0.0140028 0.00430086 0.0010002 2.0004E-4
0.784578 0.112311 0.0622062 0.0276028 0.00980098 0.00280028 6.0006E-4 1.0001E-4
0.2237 0.1647 0.188 0.1718 0.1257 0.0736 0.0345 0.018
0.383538 0.187919 0.172717 0.127113 0.0749075 0.0353035 0.0133013 0.00520052
0.50495 0.182482 0.145185 0.0924908 0.0471953 0.0192981 0.00629937 0.00209979
0.60234 0.166683 0.118188 0.0670933 0.030497 0.0110989 0.00319968 8.9991E-4
0.660534 0.152785 0.10079 0.0531947 0.0224978 0.00759924 0.00209979 4.9995E-4
0.1286 0.127 0.1727 0.1879 0.1637 0.1141 0.0637 0.0423
0.251475 0.171783 0.187981 0.164684 0.115588 0.0648935 0.0291971 0.0143986
0.3591 0.1868 0.177 0.1343 0.0815 0.0396 0.0154 0.0063
0.4547 0.1868 0.1577 0.1066 0.0576 0.025 0.0086 0.0030
0.5162 0.1812 0.1423 0.0895 0.045 0.0181 0.0058 0.0019
0.066 0.0855 0.1383 0.1792 0.1858 0.1543 0.1025 0.0884
0.1485 0.1369 0.1785 0.1862 0.1555 0.104 0.0556 0.0348
0.2314 0.1668 0.1882 0.1699 0.1228 0.0711 0.0329 0.0169
0.3131 0.1826 0.1835 0.1476 0.0951 0.049 0.0202 0.0089
0.369663 0.187381 0.175182 0.131187 0.0785921 0.0376962 0.0144986 0.00579942
0.030094 0.05019 0.0966807 0.14907 0.184063 0.181864 0.143871 0.164167
0.0783 0.0952 0.1478 0.1835 0.1825 0.1453 0.0926 0.0748
0.134013 0.129913 0.174417 0.187619 0.161416 0.111211 0.0613061 0.040104
0.1948 0.1556 0.1862 0.1784 0.1368 0.084 0.0413 0.0229
0.240124 0.169017 0.188219 0.167717 0.119712 0.0683068 0.0312031 0.0157016
0.0120988 0.0256974 0.0588941 0.108189 0.158984 0.187081 0.176182 0.272873
0.0367963 0.0577942 0.106689 0.157784 0.186781 0.176982 0.134287 0.142886
0.0692931 0.0881912 0.141086 0.180582 0.184982 0.151785 0.09969 0.0843916
0.108589 0.115688 0.164884 0.187981 0.171683 0.125487 0.0733927 0.0522948
0.1402 0.133 0.1763 0.1871 0.1589 0.108 0.0588 0.0377
0.0043 0.0115 0.0313 0.0684 0.1198 0.1678 0.1882 0.4087
0.0153 0.0305 0.0672 0.1183 0.1668 0.1882 0.1699 0.2438
0.0319 0.0522 0.0995 0.1516 0.185 0.1807 0.1412 0.1579
0.054 0.075 0.1273 0.1728 0.1879 0.1635 0.1139 0.1056
0.0731927 0.0912909 0.143986 0.181982 0.183982 0.148985 0.0964904 0.080092
0.00139972 0.0044991 0.0144971 0.0377924 0.0786843 0.131274 0.175265 0.556589
0.0056 0.0141 0.0369 0.0774 0.1298 0.1744 0.1876 0.3742
0.0129987 0.0269973 0.0611939 0.110989 0.161284 0.187481 0.174583 0.264474
0.0238 0.0424 0.0857 0.1386 0.1793 0.1858 0.1541 0.1903
0.0339034 0.0546055 0.10261 0.154415 0.185919 0.179118 0.138214 0.151215
3.9996E-4 0.00149985 0.00589941 0.0181982 0.0450955 0.089591 0.142386 0.69693
0.00179982 0.00569943 0.0176982 0.0440956 0.0881912 0.140986 0.180582 0.520948
0.0046 0.0122 0.0328 0.0709 0.1226 0.1698 0.1882 0.3989
0.00930093 0.0209021 0.050305 0.0969097 0.149315 0.184118 0.181818 0.307331
0.0139014 0.0285029 0.0638064 0.114211 0.163716 0.187919 0.172617 0.255326
0.254725 0.172517 0.187919 0.163916 0.114411 0.0639064 0.0286029 0.0140014
0.377762 0.187681 0.173783 0.128787 0.0763924 0.0362964 0.0137986 0.00549945
0.468447 0.185919 0.154415 0.10271 0.0546055 0.0233023 0.00790079 0.00270027
0.542509 0.177536 0.135227 0.0824165 0.040208 0.0157031 0.00490098 0.0015003
0.5881 0.1696 0.1223 0.0706 0.0327 0.0121 0.0036 0.0010
0.150815 0.138014 0.179018 0.185919 0.154515 0.10281 0.0548055 0.0341034
0.2468 0.1706 0.1881 0.166 0.1173 0.0663 0.03 0.0149
0.3254 0.184 0.182 0.1441 0.0913 0.0463 0.0188 0.0081
0.3948 0.1881 0.1706 0.1238 0.0719 0.0335 0.0125 0.0048
0.440144 0.187519 0.161016 0.110711 0.0609061 0.0268027 0.00950095 0.00340034
0.079808 0.0963096 0.148815 0.183918 0.182018 0.144214 0.0915092 0.0734073
0.145015 0.135314 0.177618 0.186619 0.156916 0.105611 0.0569057 0.0360036
0.20442 0.158916 0.187019 0.176318 0.133013 0.080408 0.0388039 0.0211021
0.261126 0.173817 0.187719 0.162216 0.112211 0.0621062 0.0275028 0.0133013
0.30013 0.180818 0.184918 0.151315 0.0992099 0.0520052 0.0218022 0.00980098
0.0376038 0.0586059 0.107811 0.158716 0.187019 0.176418 0.133213 0.140614
0.0762 0.0936 0.1462 0.1829 0.1831 0.1468 0.0942 0.077
0.115188 0.119588 0.167683 0.188181 0.169083 0.121588 0.069993 0.0486951
0.155431 0.140128 0.180136 0.185337 0.152631 0.10062 0.0531106 0.0326065
0.1848 0.1521 0.1851 0.1804 0.1408 0.0879 0.0439 0.025
0.0156969 0.0310938 0.0681864 0.119476 0.167566 0.188162 0.169166 0.240652
0.0356036 0.0564056 0.105011 0.156416 0.186419 0.177918 0.135914 0.146315
0.0578942 0.0785921 0.131087 0.175182 0.187381 0.160384 0.109989 0.0994901
0.0828 0.0985 0.1507 0.1847 0.1811 0.1422 0.0893 0.0707
0.1019 0.1115 0.1617 0.1876 0.1743 0.1296 0.0771 0.0563
0.00579942 0.0143986 0.0375962 0.0783922 0.130987 0.175082 0.187381 0.370363
0.0147 0.0297 0.0658 0.1166 0.1655 0.1881 0.1711 0.2485
0.0258026 0.0450045 0.0894089 0.142214 0.181118 0.184618 0.150715 0.181118
0.0392039 0.060406 0.110011 0.160516 0.187419 0.175118 0.131013 0.136314
0.050105 0.0714071 0.123112 0.170117 0.188119 0.166617 0.118012 0.112511
0.00189962 0.00579884 0.0180964 0.044891 0.0892821 0.142072 0.181064 0.516897
0.0054 0.0136 0.0359 0.0758 0.1282 0.1734 0.1878 0.3799
0.0102 0.0225 0.0532 0.1007 0.1527 0.1853 0.1801 0.2953
0.0164 0.0323 0.0701 0.1217 0.1691 0.1882 0.1676 0.2346
0.0218 0.0398 0.0818 0.1346 0.1772 0.1867 0.1576 0.2005
5.0E-4 0.0020 0.0076 0.0224 0.0531 0.1006 0.1526 0.6612
0.00170017 0.00540054 0.0171017 0.0430043 0.0866087 0.139414 0.179818 0.526953
0.0035 0.0098 0.0276 0.0622 0.1123 0.1623 0.1877 0.4346
0.0061 0.0151 0.0389 0.0804 0.1331 0.1764 0.187 0.363
0.00840084 0.0194019 0.0474047 0.0928093 0.145515 0.182618 0.183418 0.320432
1.0E-4 6.0E-4 0.0028 0.0098 0.0275 0.0621 0.1121 0.785
4.9995E-4 0.00189981 0.00709929 0.0212979 0.0509949 0.0977902 0.150085 0.670333
0.0011 0.0037 0.0125 0.0335 0.072 0.1239 0.1706 0.5827
0.0020 0.0061 0.0188 0.0464 0.0914 0.1441 0.182 0.5092
0.00290029 0.00820082 0.0239024 0.0558056 0.10421 0.155716 0.186319 0.462946
0.1963 0.1561 0.1864 0.1781 0.1362 0.0834 0.0409 0.0226
0.278 0.1772 0.1867 0.1576 0.1064 0.0575 0.0249 0.0117
0.340434 0.185419 0.179918 0.139714 0.0869087 0.0432043 0.0172017 0.00720072
0.393839 0.188119 0.170817 0.124112 0.0722072 0.0336034 0.0125013 0.00480048
0.428257 0.187881 0.163684 0.114089 0.0636936 0.0284972 0.010199 0.00369963
0.1097 0.1163 0.1653 0.1881 0.1713 0.1248 0.0728 0.0517
0.168017 0.145515 0.182618 0.183418 0.147515 0.0950095 0.0489049 0.0290029
0.216322 0.162516 0.187719 0.173617 0.128513 0.0761076 0.0361036 0.0191019
0.2602 0.1737 0.1877 0.1624 0.1125 0.0624 0.0277 0.0134
0.289829 0.179218 0.185819 0.154315 0.10251 0.0545055 0.0232023 0.0106011
0.0546055 0.0756076 0.127913 0.173217 0.187819 0.163016 0.113211 0.10461
0.0909091 0.10421 0.155716 0.186319 0.178318 0.136714 0.0838084 0.0640064
0.123412 0.124212 0.170917 0.188119 0.165817 0.116912 0.0660066 0.0446045
0.154815 0.139814 0.180018 0.185419 0.152915 0.10091 0.0533053 0.0328033
0.1769 0.1491 0.184 0.1819 0.1439 0.0912 0.0462 0.0268
0.0241024 0.0428043 0.0863086 0.139214 0.179618 0.185619 0.153515 0.188819
0.0437044 0.0651065 0.115812 0.165017 0.188019 0.171617 0.125313 0.125413
0.0628126 0.0828166 0.135627 0.177836 0.186537 0.156631 0.105321 0.0924185
0.0824 0.0982 0.1505 0.1846 0.1812 0.1424 0.0896 0.0711
0.0967 0.1081 0.159 0.1871 0.1762 0.1329 0.0802 0.0598
0.00940094 0.0212021 0.0508051 0.0975098 0.149815 0.184318 0.181518 0.305431
0.0186963 0.0354929 0.075185 0.127375 0.172865 0.187862 0.163367 0.219156
0.0284028 0.0482048 0.0939094 0.146515 0.183018 0.183018 0.146515 0.170417
0.039 0.0602 0.1097 0.1603 0.1873 0.1753 0.1313 0.1369
0.0470953 0.0683932 0.119788 0.167783 0.188181 0.168983 0.121388 0.118388
0.0032 0.0091 0.0261 0.0596 0.109 0.1597 0.1872 0.4461
0.0070007 0.0169017 0.0425043 0.0858086 0.138714 0.179418 0.185719 0.343934
0.0114 0.0244 0.0567 0.1053 0.1567 0.1865 0.1778 0.2812
0.0163016 0.0321032 0.069807 0.121412 0.168917 0.188219 0.167817 0.235424
0.020298 0.0377962 0.0786921 0.131287 0.175282 0.187381 0.160284 0.208979
0.0010 0.0034 0.0117 0.0317 0.0692 0.1206 0.1684 0.594
0.0023 0.0070 0.021 0.0504 0.097 0.1494 0.1842 0.4887
0.0039996 0.0107989 0.029897 0.0659934 0.116988 0.165783 0.188081 0.418458
0.0060 0.015 0.0387 0.0802 0.1328 0.1762 0.1871 0.364
0.0077 0.0182 0.0451 0.0896 0.1424 0.1812 0.1846 0.3312
2.9997E-4 0.00109989 0.00459954 0.0147985 0.0382962 0.0794921 0.132087 0.729327
7.0007E-4 0.00250025 0.0090009 0.0258026 0.0592059 0.108511 0.159316 0.634963
0.00120012 0.00420042 0.0137014 0.0361036 0.0761076 0.128513 0.173617 0.566557
0.0019998 0.00609939 0.0186981 0.0461954 0.0910909 0.143886 0.181882 0.510149
0.00260026 0.00760076 0.0225023 0.0533053 0.10091 0.152815 0.185419 0.474847
1.0E-4 3.0E-4 0.0015 0.0060 0.0185 0.0457 0.0904 0.8375
2.0E-4 8.0E-4 0.0034 0.0115 0.0315 0.0688 0.1201 0.7637
3.0003E-4 0.00140014 0.00550055 0.0172017 0.0432043 0.0869087 0.139714 0.705771
5.9994E-4 0.00219978 0.00789921 0.0231977 0.0544946 0.10249 0.154185 0.654935
7.9992E-4 0.00279972 0.00979902 0.0276972 0.0622938 0.112489 0.162384 0.621738
0.156016 0.140414 0.180218 0.185219 0.152415 0.10041 0.0529053 0.0324032
0.2088 0.1602 0.1873 0.1753 0.1314 0.0788 0.0378 0.0204
0.249175 0.171183 0.188081 0.165383 0.116388 0.0655934 0.029597 0.0145985
0.2843 0.1783 0.1863 0.1558 0.1043 0.0559 0.024 0.0111
0.3074 0.1818 0.1841 0.1493 0.0969 0.0503 0.0209 0.0093
0.0830917 0.0987901 0.150985 0.184782 0.180982 0.141886 0.0890911 0.070393
0.1182 0.1213 0.1689 0.1882 0.1679 0.1199 0.0685 0.0471
0.1468 0.1361 0.178 0.1864 0.1562 0.1048 0.0563 0.0354
0.172717 0.147415 0.183418 0.182618 0.145615 0.0929093 0.0475048 0.0278028
0.1903 0.1541 0.1858 0.1793 0.1386 0.0857 0.0424 0.0238
0.0394 0.0606 0.1103 0.1607 0.1874 0.175 0.1308 0.1358
0.0597 0.0801 0.1328 0.1762 0.1871 0.1591 0.1082 0.0968
0.0773 0.0944 0.147 0.1832 0.1828 0.146 0.0934 0.0759
0.094 0.1063 0.1575 0.1867 0.1772 0.1347 0.0819 0.0617
0.1056 0.1139 0.1635 0.1879 0.1728 0.1273 0.075 0.054
0.0165017 0.0324032 0.070307 0.121912 0.169317 0.188219 0.167417 0.233923
0.0267973 0.0460954 0.0910909 0.143786 0.181882 0.184082 0.149185 0.177082
0.0362 0.0571 0.1059 0.1571 0.1866 0.1775 0.1351 0.1445
0.0455046 0.0669067 0.117912 0.166517 0.188119 0.170217 0.123212 0.121612
0.0522948 0.0733927 0.125487 0.171683 0.187981 0.164884 0.115688 0.108589
0.0061 0.0151 0.0391 0.0807 0.1334 0.1765 0.187 0.3621
0.0106 0.0232 0.0545 0.1024 0.1542 0.1858 0.1792 0.2901
0.015 0.0301 0.0665 0.1175 0.1662 0.1881 0.1705 0.2461
0.019502 0.0367037 0.0770077 0.129513 0.174217 0.187619 0.161716 0.213721
0.0229 0.0413 0.084 0.1368 0.1784 0.1862 0.1556 0.1948
0.0020 0.0062 0.0189 0.0466 0.0916 0.1444 0.1821 0.5082
0.0037 0.0102 0.0284 0.0636 0.114 0.1636 0.1879 0.4286
0.0055 0.0139 0.0364 0.0766 0.129 0.1739 0.1877 0.377
0.00739926 0.0175982 0.0438956 0.0877912 0.140686 0.180382 0.185181 0.337066
0.0089 0.0202 0.049 0.0951 0.1476 0.1835 0.1826 0.3131
6.0E-4 0.0022 0.0080 0.0234 0.0549 0.103 0.1547 0.6532
0.0011 0.0039 0.0129 0.0345 0.0735 0.1256 0.1718 0.5767
0.00179982 0.00559944 0.0173983 0.0435956 0.0873913 0.140186 0.180182 0.523848
0.0024995 0.00729854 0.0217956 0.0519896 0.0990802 0.15127 0.184863 0.481204
0.0030 0.0086 0.025 0.0576 0.1066 0.1577 0.1868 0.4547
1.0001E-4 7.0007E-4 0.00290029 0.010301 0.0287029 0.0641064 0.114611 0.778578
3.0E-4 0.0013 0.0051 0.0163 0.0414 0.0841 0.1369 0.7146
5.0005E-4 0.00190019 0.00720072 0.0216022 0.0516052 0.0986099 0.150915 0.667667
7.0E-4 0.0027 0.0094 0.0268 0.0609 0.1106 0.161 0.6279
8.9991E-4 0.00319968 0.0110989 0.030497 0.0670933 0.118188 0.166683 0.60234
9.999E-5 1.9998E-4 8.9991E-4 0.00389961 0.0130987 0.0347965 0.0740926 0.872913
1.0E-4 4.0E-4 0.0018 0.0067 0.0203 0.0491 0.0952 0.8264
1.0E-4 6.0E-4 0.0026 0.0094 0.0266 0.0605 0.1102 0.79
2.0E-4 8.0E-4 0.0036 0.0121 0.0326 0.0706 0.1222 0.7579
2.0002E-4 0.0010001 0.00430043 0.0141014 0.0368037 0.0772077 0.129713 0.736674
0.263926 0.174417 0.187619 0.161416 0.111211 0.0613061 0.0271027 0.0130013
0.309731 0.182118 0.183918 0.148615 0.0961096 0.049805 0.0206021 0.00910091
0.3421 0.1856 0.1797 0.1392 0.0864 0.0429 0.017 0.0071
0.368874 0.187337 0.175435 0.131426 0.0788158 0.0378076 0.0145029 0.00580116
0.385939 0.187919 0.172317 0.126413 0.0743074 0.0349035 0.0131013 0.00510051
0.157484 0.141086 0.180582 0.184982 0.151785 0.09969 0.0523948 0.0319968
0.192219 0.154715 0.186019 0.178918 0.137814 0.0850085 0.0419042 0.0234023
0.217678 0.162884 0.187781 0.173283 0.127987 0.0756924 0.0357964 0.0188981
0.239376 0.168883 0.188181 0.167883 0.119888 0.0685931 0.0313969 0.0157984
0.2536 0.1722 0.188 0.1642 0.1148 0.0643 0.0288 0.0141
0.0841 0.0995 0.1516 0.185 0.1807 0.1412 0.0884 0.0695
0.106911 0.114611 0.164116 0.187919 0.172317 0.126513 0.0743074 0.0533053
0.124388 0.124788 0.171183 0.188081 0.165383 0.116388 0.0655934 0.0441956
0.139714 0.132713 0.176118 0.187119 0.159116 0.108311 0.0590059 0.0379038
0.14993 0.137628 0.178836 0.186037 0.154931 0.103221 0.055111 0.0343069
0.0399 0.0612 0.111 0.1613 0.1875 0.1746 0.1301 0.1344
0.0529947 0.0740926 0.126187 0.172183 0.187981 0.164284 0.114889 0.107389
0.0634063 0.0833083 0.136114 0.178018 0.186419 0.156216 0.10481 0.0917092
0.0728073 0.0910091 0.143814 0.181818 0.184118 0.149215 0.0968097 0.080408
0.0793 0.0959 0.1484 0.1838 0.1822 0.1446 0.0919 0.0739
0.0168017 0.0328033 0.0709071 0.122612 0.169817 0.188219 0.166917 0.231923
0.0233023 0.0417042 0.0847085 0.137514 0.178818 0.186019 0.155016 0.192919
0.0287029 0.0485049 0.0944094 0.147015 0.183218 0.182818 0.146015 0.169317
0.0337966 0.0543946 0.10239 0.154085 0.185781 0.179282 0.138486 0.151785
0.0373 0.0583 0.1074 0.1584 0.1869 0.1766 0.1336 0.1415
0.00620062 0.0154015 0.039504 0.0813081 0.134113 0.176918 0.186819 0.359736
0.0091 0.0205 0.0496 0.0958 0.1483 0.1838 0.1822 0.3107
0.0115 0.0246 0.0571 0.1059 0.1571 0.1866 0.1775 0.2797
0.0138 0.0284 0.0636 0.114 0.1635 0.1879 0.1728 0.256
0.0155 0.0309 0.0678 0.119 0.1673 0.1882 0.1695 0.2418
0.0020 0.0063 0.0192 0.0471 0.0923 0.1451 0.1824 0.5056
0.00310031 0.00880088 0.0253025 0.0582058 0.107311 0.158316 0.186919 0.452045
0.00409959 0.0108989 0.030097 0.0664934 0.117488 0.166183 0.188081 0.416658
0.0050 0.0129 0.0344 0.0735 0.1256 0.1717 0.188 0.3889
0.00569943 0.0142986 0.0372963 0.0779922 0.130587 0.174883 0.187481 0.371763
6.0006E-4 0.00220022 0.00810081 0.0237024 0.0555056 0.10371 0.155316 0.650865
9.0E-4 0.0033 0.0113 0.0309 0.0677 0.1189 0.1672 0.5998
0.0013 0.0042 0.0139 0.0364 0.0766 0.129 0.1739 0.5647
0.0016 0.0051 0.0163 0.0413 0.0841 0.1369 0.1784 0.5363
0.0018 0.0058 0.0179 0.0446 0.0889 0.1417 0.1809 0.5184
1.0001E-4 7.0007E-4 0.0030003 0.010401 0.0291029 0.0647065 0.115312 0.776678
1.9998E-4 0.00109989 0.00439956 0.0142986 0.0372963 0.0778922 0.130487 0.734327
3.0E-4 0.0014 0.0056 0.0174 0.0436 0.0874 0.1402 0.7041
4.0E-4 0.0018 0.0067 0.0203 0.0491 0.0952 0.1477 0.6788
5.0E-4 0.0020 0.0075 0.0222 0.0528 0.1002 0.1522 0.6626
0.611461 0.164716 0.115512 0.0649065 0.0291029 0.0105011 0.0030003 8.0008E-4
0.625263 0.161616 0.111411 0.0615062 0.0272027 0.00960096 0.00270027 7.0007E-4
0.634363 0.159416 0.108711 0.0593059 0.0259026 0.00910091 0.00250025 7.0007E-4
0.641564 0.157716 0.106511 0.0576058 0.0250025 0.00860086 0.00240024 6.0006E-4
0.646 0.1565 0.1052 0.0566 0.0244 0.0084 0.0023 6.0E-4
0.464 0.1862 0.1555 0.1039 0.0556 0.0238 0.0082 0.0028
0.4784 0.1851 0.152 0.0999 0.0525 0.0221 0.0075 0.0025
0.488 0.1842 0.1496 0.0972 0.0506 0.0211 0.0070 0.0023
0.4957 0.1835 0.1476 0.0951 0.049 0.0202 0.0067 0.0022
0.50045 0.182982 0.146385 0.0937906 0.0480952 0.019698 0.00649935 0.00209979
0.3214 0.1836 0.1825 0.1452 0.0925 0.0472 0.0193 0.0083
0.3345 0.1849 0.1808 0.1414 0.0886 0.0444 0.0178 0.0076
0.3433 0.1857 0.1795 0.1389 0.086 0.0426 0.0169 0.0071
0.3504 0.1862 0.1784 0.1368 0.084 0.0413 0.0162 0.0067
0.3549 0.1865 0.1777 0.1355 0.0827 0.0404 0.0158 0.0065
0.2013 0.1578 0.1868 0.177 0.1343 0.0815 0.0396 0.0217
0.211579 0.161084 0.187481 0.174683 0.130287 0.0777922 0.0371963 0.019898
0.218722 0.163216 0.187819 0.173017 0.127613 0.0753075 0.0356036 0.0187019
0.224378 0.164884 0.187981 0.171683 0.125387 0.0733927 0.0343966 0.0178982
0.227977 0.165883 0.188081 0.170783 0.124088 0.0721928 0.0335966 0.0173983
0.113089 0.118388 0.166783 0.188181 0.169883 0.122788 0.0710929 0.049795
0.120188 0.122388 0.169583 0.188181 0.167083 0.118788 0.0675932 0.0461954
0.125113 0.125113 0.171417 0.188019 0.165117 0.116012 0.0653065 0.0439044
0.129087 0.127287 0.172783 0.187881 0.163484 0.113889 0.0634937 0.0420958
0.1316 0.1286 0.1737 0.1877 0.1624 0.1125 0.0624 0.0411
0.0566057 0.0774077 0.129913 0.174417 0.187619 0.161416 0.111211 0.10141
0.0608939 0.0810919 0.133887 0.176782 0.186881 0.158184 0.107089 0.0951905
0.0638064 0.0837084 0.136514 0.178218 0.186319 0.155916 0.10441 0.0911091
0.0662934 0.0856914 0.138586 0.179282 0.185781 0.154085 0.10229 0.0879912
0.0678 0.087 0.1399 0.18 0.1854 0.1529 0.1009 0.0861
0.0251975 0.0441956 0.0881912 0.141086 0.180582 0.184982 0.151785 0.183982
0.0273973 0.0468953 0.0920908 0.144886 0.182282 0.183682 0.148185 0.174583
0.0289 0.0488 0.0948 0.1473 0.1834 0.1827 0.1457 0.1684
0.030203 0.050305 0.0969097 0.149315 0.184118 0.181818 0.143714 0.163616
0.0311 0.0513 0.0982 0.1505 0.1846 0.1812 0.1424 0.1607
0.00989802 0.0219956 0.0522895 0.0994801 0.15157 0.184963 0.180664 0.29914
0.0109011 0.0236024 0.0553055 0.10351 0.155116 0.186119 0.178718 0.286729
0.0116 0.0248 0.0574 0.1062 0.1574 0.1867 0.1773 0.2786
0.0122 0.0258 0.0591 0.1084 0.1592 0.1871 0.1761 0.2721
0.0125987 0.0263974 0.060194 0.109789 0.160284 0.187281 0.175282 0.268173
0.00340034 0.00950095 0.0270027 0.0612061 0.111011 0.161316 0.187519 0.439044
0.00380038 0.010401 0.0289029 0.0645065 0.115112 0.164416 0.188019 0.424842
0.00410041 0.0110011 0.030303 0.0668067 0.117812 0.166417 0.188119 0.415442
0.00430043 0.0115012 0.0314031 0.0686069 0.120012 0.168017 0.188219 0.407941
0.00450045 0.0118012 0.0321032 0.069807 0.121412 0.168917 0.188219 0.40324
0.140514 0.133113 0.176318 0.187019 0.158816 0.107911 0.0587059 0.0376038
0.269273 0.175482 0.187281 0.159984 0.109389 0.059894 0.0261974 0.0124988
0.3797 0.1878 0.1734 0.1282 0.0759 0.036 0.0136 0.0054
0.4765 0.1853 0.1524 0.1004 0.053 0.0223 0.0075 0.0026
0.538 0.1782 0.1364 0.0836 0.041 0.0161 0.0051 0.0016
0.0733 0.0914 0.1441 0.182 0.184 0.1489 0.0964 0.0799
0.161484 0.142786 0.181382 0.184482 0.150185 0.0978902 0.0509949 0.0307969
0.2484 0.171 0.1881 0.1656 0.1167 0.0658 0.0297 0.0147
0.3327 0.1847 0.181 0.142 0.0891 0.0448 0.018 0.0077
0.390461 0.187981 0.171383 0.125087 0.0730927 0.0341966 0.0127987 0.0049995
0.034 0.0547 0.1027 0.1545 0.1859 0.1791 0.1381 0.151
0.0867 0.1013 0.1532 0.1855 0.1798 0.1395 0.0866 0.0674
0.146185 0.135886 0.177882 0.186481 0.156384 0.105089 0.0564944 0.0355964
0.2102 0.1607 0.1874 0.175 0.1308 0.0783 0.0375 0.0201
0.2574 0.1731 0.1878 0.1632 0.1135 0.0632 0.0281 0.0137
0.014 0.0286 0.0639 0.1143 0.1638 0.1879 0.1725 0.255
0.0413959 0.0626937 0.112889 0.162684 0.187781 0.173383 0.128287 0.130887
0.0769 0.0942 0.1468 0.1831 0.1829 0.1463 0.0936 0.0762
0.119188 0.121888 0.169283 0.188181 0.167483 0.119288 0.0679932 0.0466953
0.1528 0.1389 0.1795 0.1857 0.1537 0.1019 0.0541 0.0334
0.0051 0.013 0.0346 0.0738 0.1259 0.172 0.188 0.3876
0.0175 0.0338 0.0725 0.1245 0.171 0.1881 0.1656 0.227
0.0359964 0.0568943 0.105589 0.156884 0.186581 0.177582 0.135386 0.145085
0.0603 0.0806 0.1333 0.1765 0.187 0.1586 0.1077 0.096
0.0811 0.0973 0.1496 0.1843 0.1816 0.1433 0.0905 0.0723
0.00159984 0.00519948 0.0163984 0.0415958 0.0843916 0.137286 0.178582 0.534947
0.00649935 0.0158984 0.0405959 0.0830917 0.135886 0.177882 0.186481 0.353665
0.0148985 0.029997 0.0662934 0.117188 0.165983 0.188081 0.170683 0.246875
0.0271 0.0465 0.0916 0.1443 0.1821 0.1839 0.1487 0.1758
0.0382923 0.0593881 0.108778 0.159468 0.187163 0.175865 0.132274 0.138772
4.999E-4 0.00179964 0.00679864 0.0203959 0.0493901 0.0954809 0.14807 0.677564
0.00220022 0.00650065 0.019902 0.0483048 0.0941094 0.146715 0.183118 0.49915
0.00539946 0.0137986 0.0362964 0.0763924 0.128787 0.173783 0.187681 0.377862
0.0107978 0.0233953 0.054889 0.102979 0.154669 0.185963 0.178964 0.288342
0.016 0.0316 0.069 0.1204 0.1682 0.1882 0.1685 0.2381
1.0001E-4 5.0005E-4 0.00240024 0.00870087 0.0252025 0.0580058 0.107011 0.79808
5.9994E-4 0.00229977 0.00849915 0.0244976 0.0568943 0.105589 0.156884 0.644736
0.0018 0.0055 0.0173 0.0434 0.0871 0.14 0.18 0.5249
0.00379962 0.010299 0.0286971 0.0640936 0.114589 0.163984 0.187881 0.426657
0.0059 0.0147 0.0381 0.0793 0.1319 0.1756 0.1873 0.3672
9.999E-5 9.999E-5 7.9992E-4 0.00329967 0.0111989 0.0306969 0.0674933 0.886311
2.0E-4 7.0E-4 0.0031 0.0109 0.03 0.0662 0.1172 0.7717
5.0E-4 0.0019 0.0072 0.0215 0.0514 0.0984 0.1506 0.6685
0.00119988 0.00389961 0.0130987 0.0347965 0.0739926 0.126187 0.172083 0.574743
0.0019 0.0059 0.0184 0.0455 0.0902 0.143 0.1815 0.5136
0.120388 0.122588 0.169683 0.188181 0.166983 0.118588 0.0674933 0.0460954
0.20478 0.158984 0.187081 0.176182 0.132887 0.080192 0.0387961 0.0210979
0.2768 0.1769 0.1868 0.1579 0.1068 0.0579 0.0251 0.0118
0.3421 0.1856 0.1797 0.1392 0.0864 0.0429 0.017 0.0071
0.3857 0.1879 0.1723 0.1265 0.0743 0.035 0.0132 0.0051
0.0609939 0.0812919 0.133987 0.176882 0.186881 0.157984 0.106989 0.0949905
0.1155 0.1197 0.1678 0.1882 0.169 0.1214 0.0699 0.0485
0.1671 0.1451 0.1824 0.1836 0.1479 0.0954 0.0492 0.0293
0.217678 0.162884 0.187781 0.173283 0.127987 0.0756924 0.0357964 0.0188981
0.2534 0.1722 0.188 0.1643 0.1149 0.0643 0.0288 0.0141
0.0275 0.047 0.0923 0.145 0.1824 0.1836 0.148 0.1742
0.0580942 0.0786921 0.131187 0.175282 0.187381 0.160284 0.109789 0.0992901
0.0903 0.1038 0.1554 0.1862 0.1785 0.1371 0.0842 0.0645
0.124388 0.124788 0.171183 0.188081 0.165383 0.116388 0.0655934 0.0441956
0.1498 0.1376 0.1788 0.186 0.155 0.1033 0.0551 0.0344
