# bench EOLE photo, generated by bep version 0.1, generation model "A"
bEpInstance_A_40_86
     40     86    100   1000     30     60     50    250    100    4.0
      1     80      1     45    -99    101     50
      2     30    459     45    359    559    218
      3     23    243     38    143    343    226
      4     47    907     37    807   1007    145
      5     56    166     31     66    266    121
      6     15     93     41     -7    193    116
      7     66    634     59    534    734     93
      8     35    369     56    269    469     80
      9     37    362     34    262    462    184
     10     82    671     45    571    771     61
     11     92    784     58    684    884    126
     12     69    161     56     61    261    101
     13     33    913     48    813   1013    146
     14      0    978     55    878   1078    184
     15     61    748     57    648    848    244
     16     11    746     33    646    846    148
     17     10    274     34    174    374    236
     18     95    666     60    566    766    222
     19     45    920     37    820   1020     77
     20      8     97     42     -3    197    132
     21      1      2     57    -98    102     53
     22     99    697     51    597    797    168
     23     44    571     47    471    671    163
     24     31    677     31    577    777    135
     25     95    207     40    107    307    229
     26     88    337     53    237    437    114
     27     25    997     44    897   1097    117
     28      9    854     53    754    954     70
     29     86    633     33    533    733    218
     30     33    807     43    707    907    205
     31     38    987     40    887   1087    189
     32     66    388     33    288    488    173
     33     60    471     45    371    571    144
     34     81    264     54    164    364     62
     35     26    251     42    151    351    121
     36     10    147     44     47    247    243
     37     78    580     54    480    680     72
     38     39    226     57    126    326    203
     39     21    224     44    124    324    226
     40     61    578     45    478    678     91
      0    115     62    226     41     28    158     92     90    167    195     40    228    245    186    187     70    166    229     30     19    174    142    169     51     84    249    213    158    201    246     96    117     65     63     40    144     57     57    144
    115      0     54    112     73     91     44     22     24     54     82     75    113    129     72     71     46     54    115     90    114     61     28     54     65     33    134     98     45     87    132     19      8     50     52     78     32     58     58     30
     62     54      0    166     20     37     98     31     29    108    136     23    167    183    126    125      8    107    169     36     60    115     82    108     20     28    188    152     98    141    186     37     57     15      2     24     85      5      4     84
    226    112    166      0    185    203     68    134    136     59     32    186      3     21     39     41    158     61      3    202    226     54     84     57    175    142     23     16     69     25     20    129    109    160    164    190     82    170    170     82
     41     73     20    185      0     20    117     51     49    126    154      3    186    203    145    145     29    125    188     21     43    133    101    127     14     43    207    172    116    160    205     55     76     25     22     12    103     15     16    103
     28     91     37    203     20      0    135     69     67    145    173     21    205    221    164    163     45    144    206      2     23    152    119    146     34     63    226    190    136    178    223     74     95     45     39     13    122     33     32    121
    158     44     98     68    117    135      0     66     68     10     38    118     70     87     28     31     91     10     71    135    158     17     16     13    106     74     91     56      5     44     88     61     40     92     96    122     13    102    103     14
     92     22     31    134     51     69     66      0      1     76    104     52    136    152     94     94     24     75    137     68     92     83     50     77     43     15    157    121     67    109    154      9     26     28     29     55     53     35     36     52
     90     24     29    136     49     67     68      1      0     78    106     50    137    154     96     96     23     77    139     66     90     85     52     78     41     14    158    123     68    111    156      9     27     26     27     54     55     34     34     54
    167     54    108     59    126    145     10     76     78      0     28    127     61     79     19     25    100      3     62    144    168      7     26     12    116     83     82     49      9     36     79     70     50    101    105    132     22    111    112     23
    195     82    136     32    154    173     38    104    106     28      0    155     35     53     11     22    129     29     35    173    196     21     54     30    144    111     55     27     37     15     52     99     78    130    134    160     51    140    141     52
     40     75     23    186      3     21    118     52     50    127    155      0    188    204    146    146     31    126    189     22     43    134    102    129     13     44    209    173    118    161    206     56     77     25     24     15    104     17     19    104
    228    113    167      3    186    205     70    136    137     61     35    188      0     18     41     42    159     63      3    204    227     56     85     59    177    144     21     15     71     26     18    131    110    162    165    191     84    171    172     84
    245    129    183     21    203    221     87    152    154     79     53    204     18      0     59     58    176     81     18    220    244     74    102     75    194    161      7     31     88     43      9    148    127    179    181    207    101    188    188    101
    186     72    126     39    145    164     28     94     96     19     11    146     41     59      0     12    119     22     43    163    187     15     44     19    135    102     62     29     29     16     60     90     69    121    124    150     42    130    131     42
    187     71    125     41    145    163     31     94     96     25     22    146     42     58     12      0    118     29     44    162    186     25     44     17    136    104     62     27     33     16     60     90     69    121    123    149     44    130    130     43
     70     46      8    158     29     45     91     24     23    100    129     31    159    176    119    118      0    100    161     44     68    108     74    100     27     25    180    145     91    133    178     31     50     17      7     31     78     14     12     77
    166     54    107     61    125    144     10     75     77      3     29    126     63     81     22     29    100      0     64    143    167      7     26     16    114     82     84     51      8     38     81     69     49    100    105    131     21    110    112     23
    229    115    169      3    188    206     71    137    139     62     35    189      3     18     43     44    161     64      0    205    229     57     87     60    178    146     19     18     72     28     16    133    112    164    167    193     85    173    174     85
     30     90     36    202     21      2    135     68     66    144    173     22    204    220    163    162     44    143    205      0     23    151    118    145     35     63    225    189    135    177    222     74     94     45     38     12    122     33     31    120
     19    114     60    226     43     23    158     92     90    168    196     43    227    244    187    186     68    167    229     23      0    175    142    168     56     86    248    213    159    201    246     97    118     68     62     36    145     56     55    144
    174     61    115     54    133    152     17     83     85      7     21    134     56     74     15     25    108      7     57    151    175      0     34     17    122     90     77     45     16     32     74     77     57    108    112    139     29    118    119     31
    142     28     82     84    101    119     16     50     52     26     54    102     85    102     44     44     74     26     87    118    142     34      0     26     91     59    106     71     18     59    104     46     25     77     80    106      8     86     86      4
    169     54    108     57    127    146     13     77     78     12     30    129     59     75     19     17    100     16     60    145    168     17     26      0    118     86     80     44     17     32     77     72     52    104    106    132     26    112    113     25
     51     65     20    175     14     34    106     43     41    116    144     13    177    194    135    136     27    114    178     35     56    122     91    118      0     32    198    163    106    150    195     45     66     14     20     26     93     14     18     93
     84     33     28    142     43     63     74     15     14     83    111     44    144    161    102    104     25     82    146     63     86     90     59     86     32      0    165    130     74    118    162     13     34     18     26     51     60     30     32     60
    249    134    188     23    207    226     91    157    158     82     55    209     21      7     62     62    180     84     19    225    248     77    106     80    198    165      0     35     92     47      4    152    131    183    186    212    105    192    193    105
    213     98    152     16    172    190     56    121    123     49     27    173     15     31     29     27    145     51     18    189    213     45     71     44    163    130     35      0     58     13     34    117     96    148    150    176     70    157    157     70
    158     45     98     69    116    136      5     67     68      9     37    118     71     88     29     33     91      8     72    135    159     16     18     17    106     74     92     58      0     45     89     61     41     92     96    122     13    102    103     15
    201     87    141     25    160    178     44    109    111     36     15    161     26     43     16     16    133     38     28    177    201     32     59     32    150    118     47     13     45      0     45    105     84    136    139    165     57    145    145     57
    246    132    186     20    205    223     88    154    156     79     52    206     18      9     60     60    178     81     16    222    246     74    104     77    195    162      4     34     89     45      0    149    129    181    184    210    102    190    190    102
     96     19     37    129     55     74     61      9      9     70     99     56    131    148     90     90     31     69    133     74     97     77     46     72     45     13    152    117     61    105    149      0     20     31     35     61     48     41     42     47
    117      8     57    109     76     95     40     26     27     50     78     77    110    127     69     69     50     49    112     94    118     57     25     52     66     34    131     96     41     84    129     20      0     52     55     81     27     61     62     26
     65     50     15    160     25     45     92     28     26    101    130     25    162    179    121    121     17    100    164     45     68    108     77    104     14     18    183    148     92    136    181     31     52      0     14     34     79     14     18     78
     63     52      2    164     22     39     96     29     27    105    134     24    165    181    124    123      7    105    167     38     62    112     80    106     20     26    186    150     96    139    184     35     55     14      0     26     83      7      6     82
     40     78     24    190     12     13    122     55     54    132    160     15    191    207    150    149     31    131    193     12     36    139    106    132     26     51    212    176    122    165    210     61     81     34     26      0    109     21     19    108
    144     32     85     82    103    122     13     53     55     22     51    104     84    101     42     44     78     21     85    122    145     29      8     26     93     60    105     70     13     57    102     48     27     79     83    109      0     89     90      4
     57     58      5    170     15     33    102     35     34    111    140     17    171    188    130    130     14    110    173     33     56    118     86    112     14     30    192    157    102    145    190     41     61     14      7     21     89      0      4     88
     57     58      4    170     16     32    103     36     34    112    141     19    172    188    131    130     12    112    174     31     55    119     86    113     18     32    193    157    103    145    190     42     62     18      6     19     90      4      0     89
    144     30     84     82    103    121     14     52     54     23     52    104     84    101     42     43     77     23     85    120    144     31      4     25     93     60    105     70     15     57    102     47     26     78     82    108      4     88     89      0