# bench EOLE photo, generated by bep version 0.1, generation model "A"
bEpInstance_A_10_35
     10     35    100   1000     30     60     50    250    100    4.0
      1     52    438     32    338    538     86
      2     16    702     33    602    802    210
      3     66    431     54    331    531     75
      4      0    773     35    673    873     58
      5     81    697     51    597    797    172
      6     47    585     31    485    685    133
      7     46    699     53    599    799    201
      8     65    381     59    281    481     84
      9     82     24     40    -76    124    248
     10     73    461     54    361    561    127
      0     66      3     84     65     36     65     14    103      7
     66      0     68     18     16     30      7     81    170     61
      3     68      0     87     66     38     67     12    101      7
     84     18     87      0     27     48     21     99    188     80
     65     16     66     27      0     29      8     79    168     59
     36     30     38     48     29      0     28     51    140     31
     65      7     67     21      8     28      0     79    168     59
     14     81     12     99     79     51     79      0     89     20
    103    170    101    188    168    140    168     89      0    109
      7     61      7     80     59     31     59     20    109      0