# bench EOLE photo, generated by bep version 0.1, generation model "A"
bEpInstance_A_35_71
     35     71    100   1000     30     60     50    250    100    4.0
      1     42    307     59    207    407    191
      2     79    651     48    551    751    234
      3     66    978     49    878   1078    141
      4     45    134     56     34    234     67
      5     34    710     35    610    810    237
      6      7    538     40    438    638    205
      7     73    451     54    351    551    209
      8     98    676     49    576    776    130
      9     99    600     33    500    700    205
     10     25    707     51    607    807    232
     11     69    328     41    228    428     77
     12     46    224     36    124    324    212
     13     94    388     52    288    488     51
     14     93     71     54    -29    171    181
     15     52    588     43    488    688    150
     16     26     84     57    -16    184     99
     17     69      0     30   -100    100    237
     18     71    713     56    613    813    128
     19      4    208     46    108    308    151
     20     43    753     39    653    853    123
     21     14     49     41    -51    149     63
     22     12    160     52     60    260    179
     23     75    170     34     70    270     52
     24     25     38     38    -62    138    238
     25      3    281     57    181    381    200
     26    100    715     34    615    815     57
     27     93    668     46    568    768    121
     28     42    848     52    748    948    162
     29     90     99     49     -1    199     53
     30     26    348     50    248    448     51
     31     52    804     30    704    904    205
     32     85    279     52    179    379    227
     33     56    584     49    484    684    161
     34     30    768     48    668    868     94
     35     44    129     47     29    229    222
      0     86    167     43    100     58     36     93     74    100      8     20     24     60     70     55     77    101     26    111     64     37     35     67     11    103     91    135     53     11    124     12     69    115     44
     86      0     81    129     18     33     50      7     13     19     80    107     65    145     17    142    162     15    112     27    151    123    120    153     94     16      5     50    138     76     38     93     17     31    130
    167     81      0    211     67    110    131     75     94     68    162    188    147    226     97    223    244     66    193     56    232    204    202    235    174     66     77     33    219    157     43    174     98     53    212
     43    129    211      0    144    101     79    136    117    143     48     22     64     19    113     13     34    144     21    154     22     10     11     24     38    145    134    178     14     53    167     37    112    158      1
    100     18     67    144      0     43     65     18     31      2     95    121     81    160     30    156    177      9    125     10    165    137    135    168    107     16     18     34    153     90     23    108     31     14    145
     58     33    110    101     43      0     27     41     27     42     54     79     43    118     16    113    135     46     82     54    122     94     93    125     64     49     38     77    111     47     67     67     16     57    102
     36     50    131     79     65     27      0     56     37     65     30     57     16     95     34     92    112     65     63     75    101     74     70    103     45     66     54     99     88     28     88     43     33     79     80
     93      7     75    136     18     41     56      0     19     19     87    113     72    151     24    149    169     11    119     23    158    130    126    160    101      9      2     45    144     83     34     99     25     28    137
     74     13     94    117     31     27     37     19      0     32     68     94     53    132     12    130    150     29    100     40    139    112    107    141     83     28     17     63    125     65     52     80     11     45    118
    100     19     68    143      2     42     65     19     32      0     95    120     81    159     30    155    177     11    124     12    164    136    134    167    106     18     19     35    152     89     25    108     31     15    144
      8     80    162     48     95     54     30     87     68     95      0     26     16     64     65     61     82     96     34    106     71     44     39     73     20     97     85    130     57     11    119     12     64    110     50
     20    107    188     22    121     79     57    113     94    120     26      0     42     40     91     35     56    122     11    132     44     18     15     46     17    123    111    156     33     31    145     16     90    136     23
     24     65    147     64     81     43     16     72     53     81     16     42      0     79     51     77     97     81     50     92     87     60     54     89     35     81     70    115     72     19    104     27     49     96     65
     60    145    226     19    160    118     95    151    132    159     64     40     79      0    129     17     18    160     40    170     20     30     25     18     57    161    149    194      7     71    183     52    128    174     18
     70     17     97    113     30     16     34     24     12     30     65     91     51    129      0    126    147     31     95     41    135    107    104    137     77     33     22     65    122     60     54     77      1     45    114
     55    142    223     13    156    113     92    149    130    155     61     35     77     17    126      0     23    157     31    167      9     19     24     11     49    158    146    191     16     66    180     50    125    171     12
     77    162    244     34    177    135    112    169    150    177     82     56     97     18    147     23      0    178     54    188     18     42     42     14     72    178    167    212     25     87    201     69    146    192     32
    101     15     66    144      9     46     65     11     29     11     96    122     81    160     31    157    178      0    127     12    166    139    135    169    109      7     12     34    153     91     23    108     32     17    146
     26    112    193     21    125     82     63    119    100    124     34     11     50     40     95     31     54    127      0    136     39     12     20     42     18    129    117    160     34     35    149     26     94    140     22
    111     27     56    154     10     54     75     23     40     12    106    132     92    170     41    167    188     12    136      0    176    148    145    178    118     17     24     23    163    101     12    118     42      4    156
     64    151    232     22    165    122    101    158    139    164     71     44     87     20    135      9     18    166     39    176      0     27     33      3     58    167    156    199     22     74    188     60    134    179     21
     37    123    204     10    137     94     74    130    112    136     44     18     60     30    107     19     42    139     12    148     27      0     15     30     30    140    128    172     24     47    161     34    106    152     11
     35    120    202     11    135     93     70    126    107    134     39     15     54     25    104     24     42    135     20    145     33     15      0     35     33    136    124    169     18     46    158     27    103    149     12
     67    153    235     24    168    125    103    160    141    167     73     46     89     18    137     11     14    169     42    178      3     30     35      0     60    170    158    202     22     77    191     62    136    182     23
     11     94    174     38    107     64     45    101     83    106     20     17     35     57     77     49     72    109     18    118     58     30     33     60      0    111     99    142     50     17    131     20     76    121     39
    103     16     66    145     16     49     66      9     28     18     97    123     81    161     33    158    178      7    129     17    167    140    136    170    111      0     11     36    154     93     25    109     34     21    147
     91      5     77    134     18     38     54      2     17     19     85    111     70    149     22    146    167     12    117     24    156    128    124    158     99     11      0     46    142     81     35     97     22     29    135
    135     50     33    178     34     77     99     45     63     35    130    156    115    194     65    191    212     34    160     23    199    172    169    202    142     36     46      0    187    125     11    142     66     20    179
     53    138    219     14    153    111     88    144    125    152     57     33     72      7    122     16     25    153     34    163     22     24     18     22     50    154    142    187      0     64    176     45    121    167     13
     11     76    157     53     90     47     28     83     65     89     11     31     19     71     60     66     87     91     35    101     74     47     46     77     17     93     81    125     64      0    114     22     59    105     54
    124     38     43    167     23     67     88     34     52     25    119    145    104    183     54    180    201     23    149     12    188    161    158    191    131     25     35     11    176    114      0    131     55     10    168
     12     93    174     37    108     67     43     99     80    108     12     16     27     52     77     50     69    108     26    118     60     34     27     62     20    109     97    142     45     22    131      0     76    123     38
     69     17     98    112     31     16     33     25     11     31     64     90     49    128      1    125    146     32     94     42    134    106    103    136     76     34     22     66    121     59     55     76      0     46    113
    115     31     53    158     14     57     79     28     45     15    110    136     96    174     45    171    192     17    140      4    179    152    149    182    121     21     29     20    167    105     10    123     46      0    159
     44    130    212      1    145    102     80    137    118    144     50     23     65     18    114     12     32    146     22    156     21     11     12     23     39    147    135    179     13     54    168     38    113    159      0