# bench EOLE photo, generated by bep version 0.1, generation model "A"
bEpInstance_A_15_82
     15     82    100   1000     30     60     50    250    100    4.0
      1     87    349     54    249    449    195
      2      6     76     47    -24    176     81
      3      1    404     52    304    504    197
      4     86    699     38    599    799    177
      5     84    610     38    510    710     91
      6     36    376     31    276    476    220
      7     75    714     48    614    814    237
      8     48    115     42     15    215    119
      9     46    186     32     86    286    155
     10     26    638     51    538    738    105
     11      4    423     30    323    523    231
     12     12    270     46    170    370    242
     13     88    821     35    721    921     98
     14     19    221     32    121    321    239
     15     94    692     57    592    792    133
      0     71     25     87     65     14     91     59     42     73     27     27    118     36     85
     71      0     82    157    134     75    160     14     29    140     86     48    187     36    155
     25     82      0     76     55     11     79     73     55     58      4     33    106     45     75
     87    157     76      0     22     81      4    146    128     21     71    108     30    120      2
     65    134     55     22      0     59     26    124    106     16     50     86     52     98     20
     14     75     11     81     59      0     85     65     47     65     14     27    112     38     80
     91    160     79      4     26     85      0    149    132     22     74    112     26    124      7
     59     14     73    146    124     65    149      0     17    130     77     39    176     27    144
     42     29     55    128    106     47    132     17      0    113     60     22    159     11    127
     73    140     58     21     16     65     22    130    113      0     54     92     48    104     21
     27     86      4     71     50     14     74     77     60     54      0     38    101     50     70
     27     48     33    108     86     27    112     39     22     92     38      0    139     12    107
    118    187    106     30     52    112     26    176    159     48    101    139      0    150     32
     36     36     45    120     98     38    124     27     11    104     50     12    150      0    119
     85    155     75      2     20     80      7    144    127     21     70    107     32    119      0