# bench EOLE photo, generated by bep version 0.1, generation model "A"
bEpInstance_A_35_17
     35     17    100   1000     30     60     50    250    100    4.0
      1     57      1     33    -99    101    234
      2     86    227     33    127    327    147
      3     66    905     49    805   1005     93
      4     28    338     55    238    438    203
      5     54    440     52    340    540    188
      6     16    603     41    503    703    197
      7     82     62     44    -38    162     95
      8     98    230     41    130    330    159
      9     23    480     44    380    580     67
     10     71    568     47    468    668    124
     11     47    198     48     98    298    201
     12     54    398     46    298    498     64
     13     84    243     53    143    343     51
     14     85    141     52     41    241    184
     15     20    219     57    119    319     85
     16     45    252     52    152    352    187
     17     73    176     53     76    276    138
     18     75    340     55    240    440     93
     19     54    394     60    294    494     64
     20     80    484     34    384    584    176
     21     73    912     49    812   1012    165
     22      5    379     37    279    479    101
     23     60    135     43     35    235     59
     24     39    147     52     47    247     74
     25     32    497     47    397    597     63
     26     84    369     38    269    469    125
     27     77    250     43    150    350    161
     28     74    595     35    495    695    142
     29     51    824     31    724    924    162
     30     20    275     55    175    375    210
     31     41    246     56    146    346    210
     32     39    578     58    478    678    194
     33      7    477     54    377    577    233
     34     85     66     38    -34    166    172
     35     32    735     35    635    835     60
      0     56    226     84    109    150     16     58    120    141     49     99     60     35     55     62     43     84     98    120    227     95     33     36    124     92     62    148    205     69     61    144    119     17    183
     56      0    169     31     53     95     41      3     65     85     12     43      4     21     16     12     13     28     42     64    171     43     23     23     68     35      6     92    149     20     12     88     65     40    127
    226    169      0    142    116     76    210    168    106     84    176    126    165    191    171    163    182    141    127    105      2    132    192    189    102    134    163     77     20    157    164     82    108    209     43
     84     31    142      0     26     66     70     32     35     58     35     16     27     51     29     21     42     11     15     38    143     11     51     47     39     16     25     65    121     15     23     60     35     69     99
    109     53    116     26      0     41     94     53     12     32     60     10     49     75     55     47     66     25     11     12    118     19     76     73     15     19     47     39     96     42     48     34     14     93     73
    150     95     76     66     41      0    136     95     30     16    101     52     91    116     96     88    107     67     53     33     78     56    117    114     26     60     89     14     55     82     89      8     31    135     33
     16     41    210     70     94    136      0     42    105    126     35     84     45     19     42     48     28     69     83    105    212     81     19     23    109     76     47    133    190     55     47    129    105      1    168
     58      3    168     32     53     95     42      0     65     84     15     43      4     22     19     14     14     28     42     63    170     43     25     25     68     34      7     91    148     22     14     88     65     41    127
    120     65    106     35     12     30    105     65      0     25     70     21     61     86     65     57     77     37     22     14    108     25     86     83      4     31     59     31     86     51     58     24      4    104     63
    141     85     84     58     32     16    126     84     25      0     92     42     81    106     88     79     98     57     43     21     86     50    108    105     20     49     79      6     64     74     80      8     27    125     42
     49     12    176     35     60    101     35     15     70     92      0     50     14     17      8     13      8     36     49     71    178     46     16     12     74     43     15     99    156     20     12     95     70     34    134
     99     43    126     16     10     52     84     43     21     42     50      0     39     64     45     36     55     15      1     22    128     13     65     62     25     10     37     49    106     31     38     45     22     83     84
     60      4    165     27     49     91     45      4     61     81     14     39      0     25     17     10     16     24     38     60    167     39     27     26     64     31      2     88    145     17     10     84     61     44    123
     35     21    191     51     75    116     19     22     86    106     17     64     25      0     25     29      9     49     63     85    192     62      6     11     89     57     27    113    170     37     28    109     86     18    149
     55     16    171     29     55     96     42     19     65     88      8     45     17     25      0     10     17     33     44     67    173     40     23     18     69     40     16     94    151     14      8     89     64     41    129
     62     12    163     21     47     88     48     14     57     79     13     36     10     29     10      0     20     23     35     58    165     33     29     26     61     30      8     86    143      8      1     81     57     47    120
     43     13    182     42     66    107     28     14     77     98      8     55     16      9     17     20      0     41     54     77    184     53     10     11     80     48     18    104    162     28     19    100     77     27    140
     84     28    141     11     25     67     69     28     37     57     36     15     24     49     33     23     41      0     14     36    143     20     51     49     40      7     22     63    121     21     24     60     38     68     99
     98     42    127     15     11     53     83     42     22     43     49      1     38     63     44     35     54     14      0     23    129     12     64     61     26      9     36     50    107     30     37     46     23     82     85
    120     64    105     38     12     33    105     63     14     21     71     22     60     85     67     58     77     36     23      0    107     32     87     84     12     28     58     27     85     54     60     25     18    104     63
    227    171      2    143    118     78    212    170    108     86    178    128    167    192    173    165    184    143    129    107      0    134    194    191    104    135    165     79     22    159    166     83    109    211     45
     95     43    132     11     19     56     81     43     25     50     46     13     39     62     40     33     53     20     12     32    134      0     62     58     30     19     36     56    111     26     34     50     24     80     89
     33     23    192     51     76    117     19     25     86    108     16     65     27      6     23     29     10     51     64     87    194     62      0      6     90     58     29    115    172     36     28    110     86     18    150
     36     23    189     47     73    114     23     25     83    105     12     62     26     11     18     26     11     49     61     84    191     58      6      0     87     56     27    112    169     32     24    107     82     23    147
    124     68    102     39     15     26    109     68      4     20     74     25     64     89     69     61     80     40     26     12    104     30     90     87      0     34     62     26     81     55     62     20      8    108     59
     92     35    134     16     19     60     76     34     31     49     43     10     31     57     40     30     48      7      9     28    135     19     58     56     34      0     29     56    114     28     32     53     33     75     92
     62      6    163     25     47     89     47      7     59     79     15     37      2     27     16      8     18     22     36     58    165     36     29     27     62     29      0     86    143     15      9     82     59     46    121
    148     92     77     65     39     14    133     91     31      6     99     49     88    113     94     86    104     63     50     27     79     56    115    112     26     56     86      0     57     81     87      9     33    132     36
    205    149     20    121     96     55    190    148     86     64    156    106    145    170    151    143    162    121    107     85     22    111    172    169     81    114    143     57      0    137    144     61     87    189     22
     69     20    157     15     42     82     55     22     51     74     20     31     17     37     14      8     28     21     30     54    159     26     36     32     55     28     15     81    137      0      8     75     50     54    115
     61     12    164     23     48     89     47     14     58     80     12     38     10     28      8      1     19     24     37     60    166     34     28     24     62     32      9     87    144      8      0     83     58     46    122
    144     88     82     60     34      8    129     88     24      8     95     45     84    109     89     81    100     60     46     25     83     50    110    107     20     53     82      9     61     75     83      0     26    128     39
    119     65    108     35     14     31    105     65      4     27     70     22     61     86     64     57     77     38     23     18    109     24     86     82      8     33     59     33     87     50     58     26      0    104     64
     17     40    209     69     93    135      1     41    104    125     34     83     44     18     41     47     27     68     82    104    211     80     18     23    108     75     46    132    189     54     46    128    104      0    167
    183    127     43     99     73     33    168    127     63     42    134     84    123    149    129    120    140     99     85     63     45     89    150    147     59     92    121     36     22    115    122     39     64    167      0