# bench EOLE photo, generated by bep version 0.1, generation model "A"
bEpInstance_A_45_12
     45     12    100   1000     30     60     50    250    100    4.0
      1     79    440     33    340    540    215
      2     69    130     39     30    230    153
      3     64    491     32    391    591    133
      4     28     87     41    -13    187    146
      5     64    130     54     30    230    229
      6     82    602     41    502    702    229
      7     19    185     59     85    285    206
      8      3    682     55    582    782    214
      9     12    925     49    825   1025    212
     10      5    953     40    853   1053    189
     11     44    412     33    312    512    196
     12     50    476     36    376    576     77
     13     61    987     31    887   1087    135
     14     59    412     39    312    512    207
     15     60    266     47    166    366    176
     16     95    372     43    272    472     64
     17     29     88     57    -12    188    120
     18      4    207     31    107    307    147
     19     62    158     36     58    258     73
     20     63    423     37    323    523     98
     21     41    292     50    192    392    250
     22     71    985     54    885   1085    110
     23     25    346     58    246    446     90
     24     72    379     38    279    479     52
     25     47    149     41     49    249    152
     26     35    412     60    312    512    245
     27     57    205     32    105    305     91
     28     63    351     43    251    451     57
     29     64    108     31      8    208    119
     30      9    820     50    720    920    119
     31     16    580     46    480    680    227
     32     96    812     57    712    912    135
     33     97    263     58    163    363    113
     34     68    926     39    826   1026     99
     35     13    385     43    285    485    202
     36     74    895     54    795    995    126
     37      0    832     52    732    932     69
     38     65    375     43    275    475    214
     39     96    983     51    883   1083    233
     40     80    600     40    500    700    201
     41     87    275     32    175    375    158
     42     20    364     54    264    464    116
     43     75    237     32    137    337    147
     44     13    886     56    786    986     76
     45     72    592     37    492    692    123
      0     77     13     89     77     40     65     63    122    129     11     11    136      8     43     17     88     61     70      5     38    136     27     15     73     13     59     22     83     96     38     93     44    121     21    113     99     16    135     40     41     24     50    112     38
     77      0     90     14      1    118     18    138    199    206     70     86    214     70     34     60     14     25      7     73     41    213     55     62      7     71     18     55      5    173    113    170     33    199     65    191    176     61    213    117     36     59     26    189    115
     13     90      0    101     90     28     77     50    109    116     20      5    124     19     56     30    101     72     83     17     50    123     37     28     85     21     71     35     95     83     25     80     57    108     29    101     86     29    123     27     54     33     63     99     25
     89     14    101      0     14    129     24    148    209    216     81     97    225     81     45     73      0     30     19     84     51    224     64     73     16     81     30     66     10    183    123    182     47    209     74    202    186     72    224    128     49     69     39    199    126
     77      1     90     14      0    118     17    138    199    206     70     86    214     70     34     60     13     24      7     73     40    213     54     62      6     70     18     55      5    173    113    170     34    199     65    191    176     61    213    117     36     59     26    189    115
     40    118     28    129    118      0    105     28     82     89     48     32     96     47     84     57    129    100    111     45     78     95     65     55    113     48     99     62    123     57     17     52     84     81     56     73     61     56     95      0     81     61     91     73      3
     65     18     77     24     17    105      0    124    185    192     57     73    200     57     22     50     24      6     12     60     27    200     40     50     11     56     10     42     22    158     98    157     27    185     50    178    161     48    200    104     28     44     19    175    102
     63    138     50    148    138     28    124      0     60     67     68     52     77     68    104     80    148    118    131     66     97     77     84     77    133     67    120     84    144     34     25     39    107     63     74     56     37     78     78     28    103     79    112     51     28
    122    199    109    209    199     82    185     60      0      7    128    112     19    128    165    139    209    179    192    126    158     21    144    137    194    128    180    144    204     26     86     35    166     14    135     17     23    138     25     83    163    140    172      9     84
    129    206    116    216    206     89    192     67      7      0    135    119     16    135    172    146    216    186    199    133    165     18    151    144    201    135    187    151    211     33     93     41    174     17    142     22     30    145     23     90    170    147    179     16     91
     11     70     20     81     70     48     57     68    128    135      0     16    143      3     36     16     81     52     63      5     30    143     17     10     65      2     51     15     76    102     42    100     39    128     10    120    105     10    143     47     35     13     44    118     45
     11     86      5     97     86     32     73     52    112    119     16      0    127     16     52     28     97     68     79     13     46    127     33     24     81     16     67     31     92     86     27     84     54    112     24    104     89     25    127     31     51     28     60    102     29
    136    214    124    225    214     96    200     77     19     16    143    127      0    143    180    153    224    195    207    141    173      2    160    152    209    143    195    159    219     43    102     44    181     15    150     23     41    153      8     96    178    156    187     27     98
      8     70     19     81     70     47     57     68    128    135      3     16    143      0     36     13     81     53     63      2     30    143     18      8     65      6     51     15     76    102     43    100     38    128     13    120    106      9    143     47     34     15     43    119     45
     43     34     56     45     34     84     22    104    165    172     36     52    180     36      0     27     45     20     27     39      8    179     21     28     29     37     15     21     39    139     79    136      9    165     31    157    142     27    179     83      7     26      8    155     81
     17     60     30     73     60     57     50     80    139    146     16     28    153     13     27      0     72     47     54     15     24    153     18      6     57     18     42      9     66    114     55    110     27    138     20    130    117      7    152     57     24     18     34    130     55
     88     14    101      0     13    129     24    148    209    216     81     97    224     81     45     72      0     30     19     84     51    224     64     73     15     81     30     66     10    183    123    181     46    209     74    202    186     72    224    128     48     69     38    199    126
     61     25     72     30     24    100      6    118    179    186     52     68    195     53     20     47     30      0     18     55     23    195     35     46     18     51     13     38     28    153     93    152     27    180     44    172    156     44    195    100     26     39     19    169     97
     70      7     83     19      7    111     12    131    192    199     63     79    207     63     27     54     19     18      0     66     33    206     47     55      4     63     11     48     12    166    106    163     27    192     58    184    169     54    206    110     29     52     20    182    108
      5     73     17     84     73     45     60     66    126    133      5     13    141      2     39     15     84     55     66      0     33    140     21     11     68      7     54     18     78    100     40     97     40    125     15    118    103     12    140     44     37     18     46    116     42
     38     41     50     51     40     78     27     97    158    165     30     46    173     30      8     24     51     23     33     33      0    173     14     23     35     30     22     15     46    132     72    130     15    158     24    150    135     21    173     77     12     18     16    148     75
    136    213    123    224    213     95    200     77     21     18    143    127      2    143    179    153    224    195    206    140    173      0    160    151    209    143    195    158    219     44    102     43    180     14    150     22     42    152      6     96    177    155    187     28     98
     27     55     37     64     54     65     40     84    144    151     17     33    160     18     21     18     64     35     47     21     14    160      0     14     49     16     36      9     60    118     58    117     27    145     10    137    121     12    160     64     23      4     29    135     62
     15     62     28     73     62     55     50     77    137    144     10     24    152      8     28      6     73     46     55     11     23    151     14      0     57     12     43      7     67    111     52    108     29    136     14    129    114      2    151     55     26     13     35    127     53
     73      7     85     16      6    113     11    133    194    201     65     81    209     65     29     57     15     18      4     68     35    209     49     57      0     65     14     50     11    168    108    166     31    194     59    186    171     56    208    113     33     54     23    184    110
     13     71     21     81     70     48     56     67    128    135      2     16    143      6     37     18     81     51     63      7     30    143     16     12     65      0     52     16     76    102     42    101     40    128      8    121    105     11    143     48     36     12     44    118     45
     59     18     71     30     18     99     10    120    180    187     51     67    195     51     15     42     30     13     11     54     22    195     36     43     14     52      0     36     24    154     94    152     17    180     46    172    157     42    194     98     19     40      9    170     96
     22     55     35     66     55     62     42     84    144    151     15     31    159     15     21      9     66     38     48     18     15    158      9      7     50     16     36      0     60    118     58    115     23    143     15    136    121      6    158     62     19     11     28    134     60
     83      5     95     10      5    123     22    144    204    211     76     92    219     76     39     66     10     28     12     78     46    219     60     67     11     76     24     60      0    178    118    176     39    204     70    196    181     66    218    123     42     64     32    194    121
     96    173     83    183    173     57    158     34     26     33    102     86     43    102    139    114    183    153    166    100    132     44    118    111    168    102    154    118    178      0     60     21    140     30    108     24      3    112     46     57    137    114    146     16     59
     38    113     25    123    113     17     98     25     86     93     42     27    102     43     79     55    123     93    106     40     72    102     58     52    108     42     94     58    118     60      0     61     81     87     48     80     63     52    102     16     78     54     87     76     14
     93    170     80    182    170     52    157     39     35     41    100     84     44    100    136    110    181    152    163     97    130     43    117    108    166    101    152    115    176     21     61      0    137     29    108     21     24    109     42     53    134    113    143     27     55
     44     33     57     47     34     84     27    107    166    174     39     54    181     38      9     27     46     27     27     40     15    180     27     29     31     40     17     23     39    140     81    137      0    165     37    158    144     29    180     84      3     31      8    157     82
    121    199    108    209    199     81    185     63     14     17    128    112     15    128    165    138    209    180    192    125    158     14    145    136    194    128    180    143    204     30     87     29    165      0    135      7     29    137     15     81    162    141    172     17     83
     21     65     29     74     65     56     50     74    135    142     10     24    150     13     31     20     74     44     58     15     24    150     10     14     59      8     46     15     70    108     48    108     37    135      0    128    111     13    150     56     33      5     40    125     53
    113    191    101    202    191     73    178     56     17     22    120    104     23    120    157    130    202    172    184    118    150     22    137    129    186    121    172    136    196     24     80     21    158      7    128      0     24    130     22     73    155    133    164     15     75
     99    176     86    186    176     61    161     37     23     30    105     89     41    106    142    117    186    156    169    103    135     42    121    114    171    105    157    121    181      3     63     24    144     29    111     24      0    115     44     61    140    117    149     13     62
     16     61     29     72     61     56     48     78    138    145     10     25    153      9     27      7     72     44     54     12     21    152     12      2     56     11     42      6     66    112     52    109     29    137     13    130    115      0    152     56     25     11     34    128     54
    135    213    123    224    213     95    200     78     25     23    143    127      8    143    179    152    224    195    206    140    173      6    160    151    208    143    194    158    218     46    102     42    180     15    150     22     44    152      0     95    177    155    186     31     97
     40    117     27    128    117      0    104     28     83     90     47     31     96     47     83     57    128    100    110     44     77     96     64     55    113     48     98     62    123     57     16     53     84     81     56     73     61     56     95      0     81     60     90     73      2
     41     36     54     49     36     81     28    103    163    170     35     51    178     34      7     24     48     26     29     37     12    177     23     26     33     36     19     19     42    137     78    134      3    162     33    155    140     25    177     81      0     27      9    153     79
     24     59     33     69     59     61     44     79    140    147     13     28    156     15     26     18     69     39     52     18     18    155      4     13     54     12     40     11     64    114     54    113     31    141      5    133    117     11    155     60     27      0     34    130     58
     50     26     63     39     26     91     19    112    172    179     44     60    187     43      8     34     38     19     20     46     16    187     29     35     23     44      9     28     32    146     87    143      8    172     40    164    149     34    186     90      9     34      0    162     88
    112    189     99    199    189     73    175     51      9     16    118    102     27    119    155    130    199    169    182    116    148     28    135    127    184    118    170    134    194     16     76     27    157     17    125     15     13    128     31     73    153    130    162      0     74
     38    115     25    126    115      3    102     28     84     91     45     29     98     45     81     55    126     97    108     42     75     98     62     53    110     45     96     60    121     59     14     55     82     83     53     75     62     54     97      2     79     58     88     74      0