# bench EOLE photo, generated by bep version 0.1, generation model "A"
bEpInstance_A_15_73
     15     73    100   1000     30     60     50    250    100    4.0
      1     13    128     47     28    228    218
      2     15     85     39    -15    185    150
      3     76    640     50    540    740    104
      4     75    228     40    128    328    149
      5     70    724     46    624    824    199
      6     70    632     36    532    732    250
      7     67    393     36    293    493     82
      8     14    276     40    176    376    105
      9     40    904     33    804   1004    162
     10     99    438     31    338    538    200
     11      7    707     30    607    807    215
     12     94    350     39    250    450    177
     13      7    859     41    759    959    206
     14     49    601     53    501    701     82
     15    100    975     40    875   1075     76
      0     10    128     29    149    126     67     37    194     80    144     59    182    118    212
     10      0    139     38    160    137     78     47    204     90    155     69    193    129    223
    128    139      0    103     21      2     61     92     66     50     24     72     57     11     83
     29     38    103      0    124    101     41     19    169     52    120     30    158     93    186
    149    160     21    124      0     23     82    112     45     71     16     93     37     31     63
    126    137      2    101     23      0     59     90     68     49     24     70     58      9     86
     67     78     61     41     82     59      0     32    127     13     79     12    117     52    145
     37     47     92     19    112     90     32      0    157     45    107     27    145     81    176
    194    204     66    169     45     68    127    157      0    117     49    139     13     75     23
     80     90     50     52     71     49     13     45    117      0     71     22    107     42    134
    144    155     24    120     16     24     79    107     49     71      0     91     38     28     70
     59     69     72     30     93     70     12     27    139     22     91      0    129     63    156
    182    193     57    158     37     58    117    145     13    107     38    129      0     65     37
    118    129     11     93     31      9     52     81     75     42     28     63     65      0     94
    212    223     83    186     63     86    145    176     23    134     70    156     37     94      0