# bench EOLE photo, generated by bep version 0.1, generation model "A"
bEpInstance_A_30_29
     30     29    100   1000     30     60     50    250    100    4.0
      1     88    462     53    362    562    102
      2     57    380     43    280    480    156
      3     83    926     53    826   1026     82
      4     10    967     36    867   1067    208
      5     22    617     47    517    717     79
      6     54    765     40    665    865    190
      7     59    331     45    231    431    168
      8     60    510     38    410    610    145
      9     98     23     52    -77    123    158
     10     40    185     32     85    285     97
     11     11    815     42    715    915     92
     12     78    613     30    513    713     51
     13     23    555     34    455    655    205
     14     32    476     44    376    576    232
     15     81    977     45    877   1077    132
     16     49    764     57    664    864    142
     17     79    626     60    526    726     88
     18     81     65     43    -35    165    235
     19     88    821     34    721    921    182
     20     43    137     50     37    237    183
     21     69    821     43    721    921     52
     22     29    908     58    808   1008     70
     23     89    419     45    319    519    124
     24     18    398     55    298    498    245
     25      2    826     34    726    926    217
     26     90    585     53    485    685    204
     27     40    894     43    794    994    218
     28      3    101     45      1    201    195
     29     93    939     52    839   1039     93
     30     85    657     39    557    757    196
      0     21    116    127     42     76     33     13    109     70     90     37     28     14    128     76     41     99     89     82     89    112     10     23     93     30    108     92    119     48
     21      0    136    147     59     96     12     32     89     48    109     58     44     24    149     96     61     78    110     60    110    132     12     10    112     51    128     71    140     69
    116    136      0     20     78     40    148    104    225    185     33     78     93    113     12     41     75    215     26    197     26     14    126    132     32     85     13    207      4     67
    127    147     20      0     87     51    159    114    237    195     38     90    103    122     17     51     86    226     41    207     39     15    138    142     35     97     19    216     21     79
     42     59     78     87      0     37     72     28    149    108     49     14     15     35     91     37     14    138     53    120     52     72     52     54     52     18     69    129     82     18
     76     96     40     51     37      0    108     63    185    145     16     38     53     72     53      1     35    175     16    157     14     36     86     92     20     45     32    166     44     28
     33     12    148    159     72    108      0     44     77     36    121     70     56     36    161    108     73     66    122     48    122    144     23     19    124     63    140     59    152     81
     13     32    104    114     28     63     44      0    122     81     77     26     14     11    116     63     29    111     78     93     77     99     23     29     80     20     96    103    107     37
    109     89    225    237    149    185     77    122      0     43    199    147    134    114    238    185    150     11    199     31    199    221     99     95    202    140    218     30    229    158
     70     48    185    195    108    145     36     81     43      0    157    107     92     72    198    144    110     31    159     12    159    180     59     53    160    100    177     22    188    118
     90    109     33     38     49     16    121     77    199    157      0     53     65     84     44     15     50    188     19    169     14     23    100    104      3     60     21    178     37     43
     37     58     78     90     14     38     70     26    147    107     53      0     19     36     91     38      3    137     52    119     52     74     48     55     56      7     70    129     81     11
     28     44     93    103     15     53     56     14    134     92     65     19      0     19    106     52     22    123     68    104     67     88     37     39     67     18     84    113     97     29
     14     24    113    122     35     72     36     11    114     72     84     36     19      0    125     72     39    103     87     84     86    108     20     19     87     30    104     94    116     47
    128    149     12     17     91     53    161    116    238    198     44     91    106    125      0     53     87    228     39    210     39     21    139    145     42     98     23    219      9     80
     76     96     41     51     37      1    108     63    185    144     15     38     52     72     53      0     35    174     17    156     15     36     86     91     19     45     32    166     45     28
     41     61     75     86     14     35     73     29    150    110     50      3     22     39     87     35      0    140     48    122     48     71     51     59     53     10     67    132     78      7
     99     78    215    226    138    175     66    111     11     31    188    137    123    103    228    174    140      0    189     20    189    211     88     84    191    130    207     21    218    148
     89    110     26     41     53     16    122     78    199    159     19     52     68     87     39     17     48    189      0    171      4     26    100    107     21     59     21    181     29     41
     82     60    197    207    120    157     48     93     31     12    169    119    104     84    210    156    122     20    171      0    171    192     71     65    172    112    189     13    200    130
     89    110     26     39     52     14    122     77    199    159     14     52     67     86     39     15     48    189      4    171      0     23    100    106     16     59     19    180     30     41
    112    132     14     15     72     36    144     99    221    180     23     74     88    108     21     36     71    211     26    192     23      0    123    127     21     82      4    201     17     64
     10     12    126    138     52     86     23     23     99     59    100     48     37     20    139     86     51     88    100     71    100    123      0     18    104     41    119     82    130     59
     23     10    132    142     54     92     19     29     95     53    104     55     39     19    145     91     59     84    107     65    106    127     18      0    107     50    124     74    136     66
     93    112     32     35     52     20    124     80    202    160      3     56     67     87     42     19     53    191     21    172     16     21    104    107      0     64     19    181     36     47
     30     51     85     97     18     45     63     20    140    100     60      7     18     30     98     45     10    130     59    112     59     82     41     50     64      0     78    122     88     18
    108    128     13     19     69     32    140     96    218    177     21     70     84    104     23     32     67    207     21    189     19      4    119    124     19     78      0    198     17     60
     92     71    207    216    129    166     59    103     30     22    178    129    113     94    219    166    132     21    181     13    180    201     82     74    181    122    198      0    210    140
    119    140      4     21     82     44    152    107    229    188     37     81     97    116      9     45     78    218     29    200     30     17    130    136     36     88     17    210      0     70
     48     69     67     79     18     28     81     37    158    118     43     11     29     47     80     28      7    148     41    130     41     64     59     66     47     18     60    140     70      0