# bench EOLE photo, generated by bep version 0.1, generation model "A"
bEpInstance_A_20_21
     20     21    100   1000     30     60     50    250    100    4.0
      1     51    154     40     54    254    190
      2      9    611     31    511    711    183
      3     89    244     35    144    344    123
      4     39     45     38    -55    145     70
      5     26    998     30    898   1098    118
      6     96    823     35    723    923    194
      7     75    482     39    382    582    152
      8     85    987     55    887   1087    120
      9     14    158     31     58    258     96
     10     77    100     57      0    200    181
     11     34     62     30    -38    162    197
     12     10    298     55    198    398    124
     13     29    837     52    737    937    101
     14     66    903     60    803   1003    130
     15     38    292     58    192    392     95
     16     28    739     47    639    839    134
     17     90    625     50    525    725    184
     18     73    550     39    450    650     64
     19     61    339     54    239    439    194
     20     64    637     32    537    737    237
      0    114     24     27    211    167     82    208      9     14     23     37    170    187     34    146    118     99     46    120
    114      0     93    141     96     57     36     95    113    128    137     78     56     74     80     32     20     22     69     15
     24     93      0     51    189    144     59    185     28     36     47     23    149    164     17    124     95     76     24     98
     27    141     51      0    238    195    109    235     28     16      4     63    198    214     61    173    145    126     73    148
    211     96    189    238      0     47    129     15    210    224    234    175     40     25    176     64     94    112    164     90
    167     57    144    195     47      0     85     41    167    180    190    132     17     21    133     27     49     68    121     47
     82     36     59    109    129     85      0    126     82     95    105     48     89    105     48     65     35     17     35     38
    208     95    185    235     15     41    126      0    208    221    231    173     40     21    174     63     90    109    162     87
      9    113     28     28    210    167     82    208      0     21     24     35    169    186     34    145    118     99     46    120
     14    128     36     16    224    180     95    221     21      0     14     52    184    200     48    160    131    112     59    134
     23    137     47      4    234    190    105    231     24     14      0     59    193    210     57    169    141    122     69    143
     37     78     23     63    175    132     48    173     35     52     59      0    134    151      7    110     84     64     16     85
    170     56    149    198     40     17     89     40    169    184    193    134      0     18    136     24     55     72    124     50
    187     74    164    214     25     21    105     21    186    200    210    151     18      0    152     42     69     88    141     66
     34     80     17     61    176    133     48    174     34     48     57      7    136    152      0    111     84     65     13     86
    146     32    124    173     64     27     65     63    145    160    169    110     24     42    111      0     32     48    100     27
    118     20     95    145     94     49     35     90    118    131    141     84     55     69     84     32      0     19     71      7
     99     22     76    126    112     68     17    109     99    112    122     64     72     88     65     48     19      0     52     21
     46     69     24     73    164    121     35    162     46     59     69     16    124    141     13    100     71     52      0     74
    120     15     98    148     90     47     38     87    120    134    143     85     50     66     86     27      7     21     74      0