# bench EOLE photo, generated by bep version 0.1, generation model "A"
bEpInstance_A_10_33
     10     33    100   1000     30     60     50    250    100    4.0
      1     31    613     44    513    713    158
      2     30    263     57    163    363    192
      3      5    262     38    162    362    112
      4     20    170     51     70    270     74
      5     95    173     40     73    273    107
      6     33    480     49    380    580    186
      7      0    741     40    641    841    224
      8     46    762     52    662    862    204
      9     37    196     39     96    296    185
     10     46    199     41     99    299    153
      0     87     87    110    111     33     32     37    104    103
     87      0      6     23     27     54    119    124     16     16
     87      6      0     23     31     54    119    125     18     18
    110     23     23      0     18     77    142    148      7      9
    111     27     31     18      0     78    143    147     15     13
     33     54     54     77     78      0     65     70     71     70
     32    119    119    142    143     65      0     12    136    135
     37    124    125    148    147     70     12      0    141    140
    104     16     18      7     15     71    136    141      0      2
    103     16     18      9     13     70    135    140      2      0