"","ERR2584219","ERR2584218","ERR2584217","ERR2584216","ERR2584215","ERR2584214","ERR2584213","ERR2584212","ERR2584211","ERR2584210","ERR2584209","ERR2584208","ERR2584207","ERR2584206","ERR2584205","ERR2584204","ERR2584203","ERR2584202","ERR2584201","ERR2584200","ERR2584199","ERR2584198","ERR2584197","ERR2584196","ERR2584195","ERR2584194","ERR2584193","ERR2584192","ERR2584191","ERR2584190","ERR2584189","ERR2584188","ERR2584187","ERR2584186","ERR2584185","ERR2584184","ERR2584183","ERR2584182","ERR2584181","ERR2584180","ERR2584179","ERR2584178","ERR2584177","ERR2584176","ERR2584175","ERR2584174","ERR2584173","ERR2584172","ERR2584171","ERR2584170","ERR2584169","ERR2584168","ERR2584167","ERR2584166","ERR2584165","ERR2584164","ERR2584163","ERR2584162","ERR2584161","ERR2584160","ERR2584159","ERR2584158","ERR2584157","ERR2584156","ERR2584155","ERR2584154","ERR2584153","ERR2584152","ERR2584151","ERR2584150","ERR2584149","ERR2584148","ERR2584147","ERR2584146","ERR2584145","ERR2584144","ERR2584143","ERR2584142","ERR2584141","ERR2584140","ERR2584139","ERR2584138","ERR2584137","ERR2584136","ERR2584135","ERR2584134","ERR2584133","ERR2584132","ERR2584131","ERR2584130","ERR2584129","ERR2584128","ERR2584127","ERR2584126","ERR2584125","ERR2584124","ERR2584123","ERR2584122","ERR2584121","ERR2584120","ERR2584119","ERR2584118","ERR2584117","ERR2584116","ERR2299371","ERR2299370","ERR2299369","ERR2299368","ERR2299367","ERR2299366","ERR2299365","ERR2299364","ERR2299363","ERR2299362","ERR2299361","ERR2299360","ERR2299359","ERR2299358","ERR2299357","ERR2299356","ERR2299355","ERR2299354","ERR2299353","ERR2299352","ERR2299351","ERR2299350","ERR2299349","ERR2299348","ERR2299347","ERR2299346","ERR2299345","ERR2299344","ERR2299343","ERR2299342","ERR2299341","ERR2299340","ERR2299339","ERR2299338","ERR2299337","ERR2299336","ERR2299335","ERR2299334","ERR2299333","ERR2299332","ERR2299331","ERR2299330"
"ERR2584219",1,0.993914360520805,0.855504996695984,0.854817578853353,0.855258010440968,0.853457658573489,0.831009074225316,0.830424805186126,0.830685351195043,0.830649517654415,0.798608928930507,0.796984626685528,0.846082387370288,0.84441203771515,0.774193408462657,0.903878559444025,0.774169819190998,0.773753173051242,0.845663559566229,0.844733399964386,0.902027436931316,0.901047429507571,0.889702603847358,0.763817827389674,0.763728753411639,0.801480981372648,0.823727936284442,0.823349096142443,0.764719749894273,0.763935529067974,0.771732884581224,0.769558582991091,0.880551310443469,0.86281441887159,0.862411301770546,0.808772583471754,0.80884960887842,0.749077990009232,0.748304900364852,0.752602055475074,0.749974622981768,0.863771282885758,0.863732687280862,0.87289784013898,0.87168173201497,0.840570214994121,0.83923285278932,0.78767784888286,0.7869733195383,0.871491597057862,0.871586752377829,0.894158872656297,0.94912577486057,0.947884984866853,0.860877429853465,0.860500856175728,0.847911176810224,0.847529497062671,0.808519538680254,0.808767400038912,0.835201429941965,0.834462203405924,0.782336829398168,0.782572455213379,0.879867625231791,0.879469634047985,0.780926976562841,0.873205818349738,0.751747609482724,0.750457090313626,0.876756289348232,0.875429981508962,0.892876157977928,0.89211502710489,0.879650125185952,0.769722186355,0.761591804253633,0.729621783297375,0.818186825381722,0.818207239473424,0.76695450275518,0.766413900616062,0.780149032449128,0.7806006621403,0.884412560855035,0.847036053972122,0.84591298075334,0.803023659564021,0.801635662904183,0.760919651635489,0.76035421946399,0.758286857631464,0.757107947123346,0.856955581639759,0.856467490000055,0.887071671677311,0.886282341329794,0.851939993070083,0.851455860326221,0.769536022472473,0.768785380166653,0.872028798944419,0.871468243606045,0.897516348326493,0.727197803496772,0.726641448983414,0.72591262771573,0.726916372569488,0.727317973947588,0.726858567132665,0.726821716930536,0.762129112409825,0.762608794792974,0.762592300141777,0.762212255943025,0.762065317069497,0.76245417039273,0.762478082411243,0.73496688391199,0.734922944181918,0.734362163589409,0.73512119624226,0.735225311154821,0.735363507884386,0.734560212680419,0.776615676541752,0.776195239004545,0.776870135671531,0.776822967046483,0.776718435556232,0.776778379491455,0.775913853624615,0.750623014639662,0.750769957427747,0.75065951118811,0.750875833454451,0.750602156116289,0.751121428070365,0.751166515158703,0.779117070884775,0.779574671768749,0.779603799180531,0.780012581406883,0.780198911501069,0.77917127198388,0.779234662613502
"ERR2584218",0.993914360520805,1,0.854682088703584,0.853854603884673,0.853892684919633,0.852427565769348,0.830017920706311,0.829271930508831,0.829266068911715,0.829450925690712,0.797493986926476,0.795555108150591,0.844877955393477,0.842986698963694,0.773566723440442,0.902433903864036,0.773121793582367,0.772808082770438,0.844957094632354,0.84412574013927,0.901883893249532,0.90112052676551,0.88836135480344,0.763374254256266,0.762740272562816,0.800016414090392,0.822711370304614,0.822069817492645,0.764306477955989,0.763029090551329,0.77102171586966,0.768503179341612,0.879821291375406,0.861513775441766,0.860865869873838,0.807752673418372,0.807650459633158,0.748040898333069,0.747695575794929,0.751671686910995,0.749064776825196,0.862059732245948,0.861885045666359,0.87257699760646,0.870604432987507,0.839718257132,0.83863580699355,0.787402424567989,0.786365630633996,0.870025952440003,0.869936958694925,0.893289452483236,0.947361615891919,0.947006398801131,0.86005346199017,0.859642056150318,0.84672023175351,0.846507529440098,0.807487131913682,0.807732467313155,0.834233615676869,0.83323616636079,0.781307512947713,0.781309086368313,0.87838192907156,0.877915022447278,0.779954207080078,0.871144460381242,0.750846580321183,0.749617242090533,0.875042294180384,0.873504179339183,0.891255699705196,0.890719784938436,0.878243802347835,0.768865778871287,0.760878457591149,0.728772503911853,0.81704340736847,0.816879368821952,0.766788330061402,0.766087761540529,0.779113492103495,0.779780932838995,0.883477342393873,0.844828274123034,0.8438010235478,0.802099842678259,0.800984214760496,0.759909105329805,0.759010852045543,0.757213578590686,0.756378291847852,0.855451076228317,0.854457674264867,0.885881438723666,0.88493921543613,0.851295546008497,0.850898289534635,0.76849399545894,0.768064890737826,0.870382849142464,0.869654364391557,0.896479091932792,0.725128878205038,0.724710736769738,0.723959554233749,0.725172438823013,0.725328260320581,0.724883063890184,0.725074237932273,0.760650625960754,0.761146057154426,0.761189563403864,0.760894784605054,0.760827732881419,0.7608027103998,0.760875947222422,0.733101923095479,0.73294249492819,0.732299445891285,0.733462123249509,0.73306822693763,0.733504320243912,0.73280264934287,0.77509181110968,0.774851451700621,0.775662257561303,0.775546422200983,0.775262384332848,0.775302488292046,0.774691371403486,0.749011952570587,0.749242087172899,0.749034395014194,0.749341426855052,0.749189499958782,0.749615504346438,0.749182724549745,0.778002870857481,0.778365297607235,0.778338013130549,0.778630241479348,0.778938516126991,0.778019708098233,0.778013464898958
"ERR2584217",0.855504996695984,0.854682088703584,1,0.994341092633717,0.843297437984147,0.841921562155451,0.795779836205358,0.794781080337027,0.822266930624336,0.821882467257175,0.881723707093646,0.880593382128011,0.924867330714085,0.924684849030763,0.731366692356944,0.855168783855931,0.752952538834819,0.752293329107287,0.909061446395463,0.908519573591628,0.848796726856575,0.84869436548322,0.842597629291659,0.83789980396406,0.724345075760776,0.851556725663545,0.869946281224022,0.868782832011853,0.706919717920179,0.70615650223589,0.857267521068877,0.855700926515043,0.823387383260378,0.78616275946255,0.785627109102429,0.751085788688199,0.750975291300056,0.838931541549156,0.838684150236339,0.702549699286204,0.699414499053201,0.789440237337743,0.789328776808066,0.878474839465384,0.877354346545302,0.773577907022589,0.773706584751976,0.755169460761272,0.754691858444684,0.810448736545035,0.810212354459244,0.913294235308777,0.823714706686564,0.822586281190092,0.974636432826383,0.974130374521527,0.834612313462357,0.83401710004116,0.763034713838203,0.76382813299942,0.836900740961236,0.836652173199537,0.865273610936824,0.86506536290003,0.878327849711327,0.878055228452876,0.734447980456824,0.81952187044575,0.720446714953479,0.721023678054653,0.893968455521658,0.893035610464196,0.908004981746769,0.90759547286094,0.842208852881966,0.84988715752722,0.71998339887018,0.821386299515377,0.885818486327315,0.886158223926584,0.709471030507743,0.708481633064385,0.860326345118571,0.860599107905621,0.833728415033785,0.769395626813189,0.767695040420929,0.753652902560774,0.75203845483074,0.841787528232155,0.841666387455195,0.710265333867851,0.709423618045443,0.78266756055248,0.782905811479097,0.880331447776293,0.879498438816171,0.797450725336386,0.796706288097123,0.711002245262232,0.710140374571595,0.813727557988038,0.812837608796378,0.925111386145594,0.686430823371572,0.685930431071175,0.685272836380648,0.685866361639602,0.686445516774999,0.686055166208586,0.685898778567633,0.713635579143845,0.713380509443843,0.713444766765104,0.713461248555049,0.713078813621995,0.713065503989235,0.713542503463453,0.691429392874867,0.690562906181314,0.690754014507316,0.691729533996713,0.691217269482241,0.691203970380006,0.690715598827055,0.718124477963727,0.717711172110892,0.719208680189333,0.718506401185027,0.718367388121737,0.718351936171206,0.718744839039622,0.704241169836858,0.705235873262708,0.704297468777777,0.704911258184484,0.704980721621842,0.70587727578103,0.70440325190606,0.72383833717028,0.72269562711841,0.722748835661228,0.722970543035221,0.722729138354896,0.722353208858815,0.722518867683616
"ERR2584216",0.854817578853353,0.853854603884673,0.994341092633717,1,0.843169853564864,0.841866640762808,0.794474401137633,0.79403304746705,0.822550319475442,0.821932148786965,0.881160942495627,0.879785825556043,0.924357023831875,0.923778231376933,0.730792636492628,0.853842906696322,0.752345942327353,0.752230263691941,0.908254777699838,0.907601429806962,0.848920635425429,0.848800374159605,0.842008988442824,0.837443842320573,0.724269609394728,0.851078639804094,0.869423147180421,0.868460773473517,0.706008656616611,0.705824375948077,0.856919317352086,0.855494578423454,0.823124474327425,0.785754845358828,0.785216315542769,0.750511810311724,0.750515208675401,0.838638824050978,0.838486034435889,0.701630750980905,0.698626484136856,0.78919505234195,0.788422245101402,0.877811364436873,0.876994074987306,0.773602194708591,0.773252641880654,0.754693167206567,0.754518933782368,0.810059201489505,0.809742308849695,0.912894923649997,0.822829231857368,0.821980813154468,0.974185942510115,0.973136408269349,0.834410566909323,0.833761256208064,0.762284557342261,0.76282862446826,0.836475040385705,0.836151718960175,0.864903299188366,0.864803699327211,0.878176311996736,0.877953882185307,0.733707516767956,0.818573100352408,0.720183681826784,0.720637067885845,0.893213490378486,0.892534086263852,0.90803302093144,0.907312197390443,0.841257793113088,0.849407548838717,0.719879644880056,0.821146603841038,0.885584095666725,0.885555716567306,0.708835441587396,0.70750848341323,0.859891388768135,0.860000702146527,0.833274201696216,0.768793440150101,0.767131469474974,0.753037986755464,0.751528976160763,0.841391684253312,0.841038736533741,0.709510029969179,0.708785582082051,0.78209564715622,0.782643612016724,0.879703706806012,0.879227339384676,0.797615549831983,0.796455403238692,0.710076702171809,0.709272413629551,0.813135365016468,0.812354957301325,0.924405226901257,0.685574886445363,0.684835300372594,0.684108858630649,0.684890105419202,0.685474443290327,0.685138617922304,0.684727959913542,0.713000617699392,0.712402800046631,0.712470202163276,0.712467839316647,0.712083531147214,0.712252721942864,0.712912070497465,0.690563794918915,0.689755477061937,0.690247307947223,0.690618331230312,0.690309255630232,0.690354071476501,0.689755800551223,0.717380159964633,0.717024635710051,0.71868514928747,0.718218675869954,0.717676350030348,0.717938890507762,0.718303325178209,0.703337639551687,0.704234735703429,0.703272665975074,0.703874047269556,0.70389799965546,0.705060678592423,0.703626868220174,0.723241531640546,0.722142608974399,0.722131061518623,0.722188318057492,0.722050777489906,0.721761190720893,0.721902518204162
"ERR2584215",0.855258010440968,0.853892684919633,0.843297437984147,0.843169853564864,1,0.993510303618082,0.797286784212341,0.797201581778024,0.764579119573542,0.764199470857217,0.754177138313903,0.753422644680771,0.809692914541321,0.808620866860325,0.731151844162469,0.856547923392479,0.731834073686354,0.731159404338256,0.789208292316307,0.788165816797141,0.851828678788182,0.851445084800019,0.902429677024725,0.717894258978012,0.736292058704235,0.751087839661066,0.772560221890245,0.771578964732269,0.726277423068821,0.725826990681981,0.722373373106662,0.721633459995895,0.811993449032435,0.798347305751897,0.797713912692563,0.756430715130243,0.75685627188228,0.70488196202918,0.704779802177899,0.711985833353953,0.71086932767752,0.799628169442465,0.79960891484328,0.829642180672662,0.828311992164652,0.770266903824562,0.769319533524556,0.744051070488207,0.743498245569476,0.83363823120798,0.832639658872873,0.85541317825616,0.844322518319098,0.841952718182739,0.823225534602934,0.82217707802721,0.982368086685101,0.981370641838345,0.765862338059601,0.766125536026949,0.777630050525812,0.777973701611047,0.732538354829132,0.731404834054514,0.866134922158668,0.864876613041922,0.737199475700535,0.84074221522358,0.721417293565579,0.720052976367114,0.844851844881294,0.843629585063578,0.863613803434602,0.86284694106847,0.894344887437501,0.7263804316964,0.736536410092682,0.678510732926595,0.768473700126623,0.767909010950876,0.732939576654731,0.731799734022917,0.735898974528059,0.736155821745671,0.823676694444497,0.787974520467526,0.786422454402595,0.767460762350069,0.76674291687659,0.714758701409494,0.714497148121582,0.718378478103243,0.716822234077178,0.790660078023323,0.791018614978006,0.848220335120024,0.847571483234337,0.807895328754208,0.807392372588631,0.73151175351751,0.731123307288638,0.83620104778927,0.83574626525846,0.859459037140851,0.811803388198581,0.811997250650176,0.811406423448841,0.812204083206741,0.812215114422327,0.812018987586462,0.81235797208331,0.836829590090217,0.836603107886995,0.836760548804626,0.836842732296067,0.836486710943881,0.836507655549568,0.836762696566999,0.805686676740638,0.805253425800766,0.80494659906843,0.805786207902711,0.805623725627429,0.805917572418788,0.804957515973089,0.828906675518873,0.82873053525564,0.829483113215619,0.829154633172618,0.828858311474362,0.829466532313585,0.829260055946593,0.815827652921283,0.816035136377335,0.815703274588955,0.816259764182615,0.815473972151988,0.816340271157292,0.815831707302317,0.828554272810161,0.828801521601272,0.828023444099638,0.828112761591647,0.828487940025521,0.827881258464761,0.827990544522781
"ERR2584214",0.853457658573489,0.852427565769348,0.841921562155451,0.841866640762808,0.993510303618082,1,0.795297166185466,0.795637279963608,0.763841485955761,0.763651069569726,0.752485094164899,0.751620321276849,0.808109063964597,0.807124847600348,0.729825671131949,0.85453143859834,0.730589019831779,0.730003607853883,0.7877712829778,0.786516409646351,0.850748867045847,0.850294003634622,0.900964368490366,0.716094069499605,0.734634123115394,0.74952458732197,0.770437424629271,0.769851434068896,0.72551849672049,0.724915789580058,0.721164462483853,0.720587671684393,0.81101782803036,0.797615866431256,0.79678346129711,0.754714465982134,0.755053164005526,0.703413305975453,0.703651521858943,0.711104799189247,0.70938663860506,0.798890358292392,0.798582552622741,0.828441794707653,0.827654330803687,0.768274828108584,0.767808790573251,0.742604904033869,0.742538969295666,0.831810164128434,0.831564735606744,0.853942113267899,0.842631084515692,0.840254438877626,0.82192933373456,0.820852801949689,0.981522908037526,0.980533533491015,0.764336569790867,0.764239546200847,0.776963003011984,0.776788280157434,0.731114842646378,0.730074860789564,0.86478901187904,0.863102558104983,0.735721755242658,0.839161090091518,0.720426094454846,0.719177769043569,0.843797899340998,0.842846690499792,0.86252054847311,0.861830092851867,0.893006943780637,0.724798399969217,0.734765772439499,0.67702838254983,0.7673732810182,0.766810531971302,0.73182710593378,0.730772596467141,0.734513654017284,0.734422110541685,0.822329111785978,0.786587345454615,0.785550089317823,0.766626649192643,0.76508912765266,0.713141369957519,0.712892623781395,0.716424418359039,0.715740974542494,0.789939408107627,0.790268131275077,0.846954905542203,0.846154200257255,0.806109078463646,0.805577882744163,0.730782667843168,0.730440402274822,0.835264136447717,0.834954202448173,0.857971021302117,0.810657893454125,0.810923418184423,0.810499462103542,0.81095470024027,0.81092627010849,0.810579753484796,0.811323309480016,0.835340998896993,0.835456964955295,0.83525819937565,0.83547607184867,0.834923777246266,0.835184500393491,0.835179002712215,0.804597780452076,0.804066248003892,0.803789215821907,0.804741630323617,0.804322784225372,0.804464635709899,0.804032645739164,0.827604079584642,0.827307300488411,0.827883703608653,0.827659175703123,0.827616496925681,0.828026170965323,0.827626963395764,0.814560516628262,0.814858430093036,0.814509893642438,0.814874716665337,0.814560037143206,0.815363193483183,0.814718924820015,0.827131591812213,0.827457744392896,0.826539258107829,0.826906482220369,0.827409705426679,0.826599694157133,0.826826650924154
"ERR2584213",0.831009074225316,0.830017920706311,0.795779836205358,0.794474401137633,0.797286784212341,0.795297166185466,1,0.996083735452665,0.74015004537728,0.738843174757361,0.774072669565249,0.773211648072849,0.817921843220871,0.817559427101599,0.931075336360344,0.842165124486985,0.919915347686975,0.918283139776099,0.808948041958603,0.807986423488986,0.820001852898276,0.819468972620871,0.810925557136343,0.73955866657957,0.705648918958765,0.772973027903247,0.798200156633166,0.797437380302448,0.904907424772436,0.904538444712748,0.749649354220515,0.747942623832999,0.801047878857584,0.797350079607676,0.795938779080953,0.948084852163841,0.947763218083888,0.728125778314023,0.72848727611991,0.914205738835285,0.912447409400703,0.783000846249948,0.781837691663926,0.830116646481023,0.829504576662298,0.765982465462522,0.765341209906008,0.924055464046116,0.92229824184103,0.836344295149293,0.835258742651638,0.828955110468895,0.814524214099227,0.813844453455322,0.796490370529419,0.796275548582225,0.793144591434629,0.793217466082354,0.981247628795118,0.981333626446722,0.743912157041291,0.743471100082811,0.755998834488417,0.755682515554427,0.810413675345041,0.809549337679127,0.925011768687001,0.829990244655186,0.919253208762245,0.918669948517964,0.82930850435675,0.827917793842953,0.830135214371688,0.829100553722768,0.803911762677372,0.747941068166595,0.704397615477745,0.708977459356101,0.798469716896844,0.798323406810257,0.917827507368866,0.91684518008057,0.756951098037779,0.756263835638373,0.809918771006382,0.773618451544488,0.771995950613923,0.971885244211737,0.970329623934148,0.739271053831746,0.738181700901231,0.917523829535737,0.915510174414604,0.77517972300198,0.774240611973238,0.886778642378335,0.885644053315466,0.765369118961163,0.764309763558321,0.914071493438854,0.914058653354824,0.838002033136527,0.8368251148166,0.837023588380373,0.690718281656233,0.689884050710672,0.689257895477605,0.690951905820619,0.691094698913137,0.690965486475554,0.690576377869822,0.723022263681996,0.722980524298447,0.724125609444302,0.723631087211197,0.723389559836554,0.72324903982427,0.723122255560547,0.703316886716819,0.703160208076565,0.701938575732673,0.703147330223776,0.703567236232268,0.703581953762436,0.702967869790767,0.740926484493564,0.740445880852021,0.740973204843699,0.741062897548212,0.740696614229548,0.740577831197279,0.740350437066271,0.717270160548525,0.717816762696479,0.717563369863471,0.717635576938445,0.71784034060926,0.717891482871285,0.717533104981085,0.743923031126661,0.744460936912421,0.743878379827152,0.744737985258629,0.74482976541978,0.743526054991404,0.744087509977652
"ERR2584212",0.830424805186126,0.829271930508831,0.794781080337027,0.79403304746705,0.797201581778024,0.795637279963608,0.996083735452665,1,0.739890369378169,0.738656291076615,0.772734431342859,0.771908253156337,0.817588165058936,0.81707598011713,0.930517512978943,0.84147291226165,0.919660222748252,0.917666685425283,0.808338009301082,0.807451383390111,0.820199447559996,0.819887017101394,0.810718512211475,0.739045713261664,0.705262113339353,0.772648821887597,0.797878645932744,0.79723277306616,0.904122448965665,0.904269566215053,0.748834801707679,0.747016514031052,0.801055441870324,0.796970229154163,0.795693080779774,0.947447526095837,0.947109950339286,0.727398062876871,0.727753786012435,0.913453807445917,0.9116741564081,0.782706346193116,0.781329700573576,0.830331585885336,0.829920658093864,0.76595068805448,0.765526769984198,0.923627327600583,0.921469833254517,0.83600419523346,0.834815693402704,0.828878543280754,0.813970185158779,0.813114275422948,0.79598283214494,0.795943933196426,0.793017490917633,0.793096414334145,0.980728271730167,0.980449164139547,0.743554000131531,0.743237808287081,0.755191841901601,0.754567752812437,0.810731379927517,0.809592067045128,0.924170376054156,0.829483994236489,0.918775501830516,0.919120060206982,0.829299461954716,0.827776998651933,0.829929062160671,0.82866747555918,0.803571489906764,0.747211293064098,0.703881927243966,0.708411881614314,0.798089247727797,0.797569318708304,0.917118993513903,0.91533698377544,0.756314111198088,0.755368964114877,0.80957136170668,0.772842949975689,0.771567467065795,0.971737345794021,0.970278432975543,0.738282005085782,0.73753497097871,0.917307581190631,0.915204442212483,0.774919705641345,0.773855708842378,0.886500575851218,0.88514034488753,0.76557408607267,0.76413187048077,0.913456938679941,0.913322941221562,0.838198658669423,0.837142300869235,0.83693069786141,0.689664356677547,0.688673574136053,0.688279609021226,0.689786261609436,0.689869514868971,0.689790975487981,0.689441241747022,0.721999777617735,0.721969448113148,0.722977301864522,0.722680822106477,0.722176140334942,0.722214142163641,0.722264948227506,0.702028193496937,0.701880111842352,0.700855526789823,0.701706182630647,0.70222361626169,0.702443111610694,0.701812436335627,0.740148444613601,0.7398481941143,0.740191539591779,0.74029238490649,0.74000379395495,0.739764343533568,0.739474470546416,0.716281019977703,0.716691809293313,0.716186062240734,0.716440152045934,0.716494218092873,0.716802621410241,0.716586547313787,0.74306840452581,0.743663855001122,0.743097537149647,0.743884006151786,0.743873428658095,0.742603277880651,0.743080426069396
"ERR2584211",0.830685351195043,0.829266068911715,0.822266930624336,0.822550319475442,0.764579119573542,0.763841485955761,0.74015004537728,0.739890369378169,1,0.994813266185766,0.740902254318268,0.738991239710956,0.787573575843639,0.786428056471525,0.684265147024702,0.804673417778898,0.697965321753993,0.699028662522839,0.802523881559751,0.801897933944096,0.846647082514846,0.846459638014778,0.797411960084651,0.728034093865094,0.722145819063616,0.7523740031141,0.77013007516348,0.769565719251325,0.659771006584673,0.659479044640992,0.732576134020636,0.730747942686171,0.862781938185476,0.827928437168048,0.826854284502591,0.704686910932245,0.705742852976241,0.715618560210317,0.714550949520329,0.657674727995961,0.655759047769226,0.808602698235606,0.808018510067151,0.783021499436426,0.782676921067376,0.833700415819178,0.832670719015698,0.708550077732346,0.706582894952345,0.773586518764566,0.77367882126249,0.83812231988789,0.787839861771337,0.787593111256865,0.825694232299281,0.825039135970166,0.765985585412026,0.765065951690877,0.717464168397808,0.717563258531292,0.978268022222354,0.977778878351768,0.732556148385563,0.731765119758699,0.867380964594015,0.866861359926619,0.684890033838153,0.787786445700596,0.660147121488733,0.660063414219322,0.799661535543944,0.798012078738297,0.83118015167311,0.830054361116529,0.792334118476713,0.727592384637596,0.715575558363453,0.730642472275388,0.783562912139007,0.782935525782777,0.66138341402385,0.660701747216461,0.730683167595435,0.730774070852943,0.854067456605446,0.832525394728753,0.831898684147603,0.703468631091629,0.703027299845557,0.71760147079026,0.716793053114904,0.665748303705287,0.664661606938838,0.8291009166505,0.828833419113539,0.796161465447306,0.795901889939505,0.860060133587551,0.859147730919412,0.664401283163672,0.663682846441972,0.777255408319934,0.776929829036283,0.828568255961201,0.664223284026353,0.663755143545432,0.663980627412059,0.663992705817468,0.664222658445784,0.664878929584104,0.663546896764627,0.691042187383391,0.691153699422717,0.69073156524813,0.690596327616804,0.690515663146597,0.691123121637116,0.690975064977104,0.673656299803607,0.67319678340509,0.67314718486917,0.673824924579776,0.673196495974998,0.673386260179494,0.673418536662901,0.702900013517197,0.703009620914084,0.704093023484716,0.703498204939452,0.703086148687067,0.703275533312351,0.703860899323564,0.685079862331034,0.685442454064516,0.684498085196982,0.685516374252909,0.685165008005051,0.686290253827339,0.685267339055584,0.705235777834291,0.705133738618331,0.70472782468806,0.705232413244995,0.705602819038087,0.704823699401568,0.70469794791739
"ERR2584210",0.830649517654415,0.829450925690712,0.821882467257175,0.821932148786965,0.764199470857217,0.763651069569726,0.738843174757361,0.738656291076615,0.994813266185766,1,0.740165422795642,0.738722944833954,0.786691776225699,0.785950165095433,0.683257827582059,0.803967923675261,0.696181683403176,0.697734934224437,0.801653260708303,0.801291867590486,0.847219730919142,0.846734730757713,0.796841858911969,0.727614418278072,0.722212868642293,0.75200403214091,0.769287316840501,0.768933764273494,0.65949838775679,0.659335223705938,0.732145937943711,0.729987583974621,0.862651478687147,0.827528582634577,0.826308512403473,0.703575350570821,0.704372988140005,0.714941540676218,0.714115486187171,0.656666745047426,0.654666221012244,0.808234305546064,0.807731784232212,0.783112785017724,0.782777789000711,0.833233576226445,0.832673774097659,0.707952915767544,0.70589155760976,0.773181125585944,0.772868564968701,0.838262285001205,0.78807607268135,0.787285211249859,0.82517736671725,0.824360794237767,0.765386306976232,0.764192415634707,0.71590066656706,0.715979957141716,0.977823829297584,0.977088424261629,0.732341151900547,0.731609110302624,0.866701361801079,0.865783049023091,0.683859415113386,0.787236181194923,0.659318158257755,0.659490163061869,0.799270725416946,0.797789576069589,0.830700377411043,0.829917247568312,0.791603740649483,0.72740350474603,0.715346381324903,0.730397722213592,0.782797668422478,0.782087265500799,0.661041334844673,0.660193942521451,0.730097862827063,0.730485312163808,0.853921333285223,0.83238935737126,0.831146713476902,0.702411334949479,0.701968152243631,0.717294948007708,0.71649697045083,0.664578476280463,0.663779573907625,0.828979741627998,0.828339395801024,0.795549494200556,0.795318202555128,0.859148170771538,0.858428060329427,0.663815548981606,0.663074378022005,0.776748981552884,0.776604175719726,0.828474260054062,0.664312237906137,0.663768630276318,0.663940797512679,0.663919924871538,0.664281720108819,0.664572406073922,0.663921174609419,0.690986850903293,0.691198863293894,0.690625912440878,0.690748627216712,0.690387146352297,0.69111167847917,0.690912676359088,0.673412796934871,0.673116025198415,0.673130780158117,0.673979633745067,0.67329096951066,0.673504967866852,0.673448507655127,0.702952543060213,0.703240544637777,0.703947608181413,0.703451006388522,0.703179399523072,0.703170663404823,0.703546419331044,0.685147721338002,0.685556196530822,0.684428374469595,0.685484844378953,0.685169787224669,0.686660948562244,0.685459303482972,0.705259771556447,0.705243216181285,0.704637613480363,0.705315499517723,0.705473425518984,0.704872776300773,0.70485731222758
"ERR2584209",0.798608928930507,0.797493986926476,0.881723707093646,0.881160942495627,0.754177138313903,0.752485094164899,0.774072669565249,0.772734431342859,0.740902254318268,0.740165422795642,1,0.992802408812855,0.940552772850685,0.93947295818697,0.738074905545368,0.810976604760993,0.741551470556489,0.741432989349945,0.895198572219625,0.894470574456942,0.780547231675713,0.779739935400255,0.762703764551395,0.944360140497879,0.714493971280214,0.920250207403861,0.914771900477451,0.913091292089434,0.727182271039292,0.726232881879519,0.964380935475902,0.963443766732984,0.78423931784429,0.765982368715193,0.765154595389991,0.749754567506634,0.749450278064901,0.961100044928531,0.960102510812033,0.719693620327871,0.716736442290901,0.766981987437714,0.766314751301221,0.842864811111356,0.841206402488212,0.746372322624989,0.745874451870737,0.749622784271328,0.748110744368007,0.80469353610213,0.8040565008555,0.831934595887904,0.765499131457716,0.76536622250387,0.858528044236855,0.856993576491452,0.75068280417722,0.750206008242437,0.761180484831936,0.760886845754616,0.739662797463076,0.739159626934017,0.984714310512193,0.984113896996976,0.755582999252927,0.755878816648007,0.739130807378589,0.795893090977673,0.712082435911122,0.711820458677702,0.806763210438389,0.805716813497822,0.819230285520271,0.818863779679269,0.762304279660919,0.960461736096942,0.710162854754758,0.873756985599559,0.893938948084644,0.893151457546693,0.725993847769413,0.724961847760457,0.970403887827163,0.969719852965392,0.786141084581167,0.743473633926923,0.742236570593148,0.753297944673371,0.751568121033764,0.963654818128743,0.963036536169609,0.719781031999634,0.718536906451738,0.755943055345721,0.755924041283995,0.801514464237389,0.800889094376926,0.741684917143565,0.74123482463188,0.730378670228394,0.729477322188968,0.803438348970193,0.80262636133693,0.839691515504073,0.649065292449997,0.648128856549433,0.646670222613634,0.648562637817127,0.648765794328578,0.647982378220452,0.648346518075735,0.682664712316627,0.682499740340824,0.68311973819985,0.683446278935644,0.683024757957939,0.682868262194293,0.683061675137812,0.659354571002059,0.659262973769026,0.658246483198846,0.659027820201353,0.659606029611482,0.660043654875762,0.659331794318913,0.700635341286045,0.699808234401981,0.701359543588813,0.701217415380678,0.700894928823061,0.701030114547732,0.700481076448479,0.678308286234824,0.679434098269096,0.678890443757255,0.678921742776096,0.679000541128223,0.679337799256222,0.678866658847685,0.709689856407367,0.709629493754269,0.709986298240353,0.710188496685473,0.709915176686876,0.709552124806299,0.709210486292729
"ERR2584208",0.796984626685528,0.795555108150591,0.880593382128011,0.879785825556043,0.753422644680771,0.751620321276849,0.773211648072849,0.771908253156337,0.738991239710956,0.738722944833954,0.992802408812855,1,0.938709616342915,0.938250223217272,0.736832373684641,0.809880855421432,0.740804318517884,0.739807887199287,0.893615217074692,0.892885342200997,0.779686244327419,0.779123121538291,0.761197838890595,0.943086769250503,0.712759679630156,0.919419271998294,0.913538703991485,0.912029797321692,0.726763357467183,0.725629523302626,0.963210201242179,0.962171779070584,0.782305432268849,0.764366328177694,0.763730519615778,0.748953431434042,0.748186402621823,0.959316544086769,0.958982214178216,0.71833806736414,0.715254387197086,0.765477736112424,0.764866666117335,0.841557339455949,0.84001928470469,0.74397314050206,0.744597786812498,0.749016989682442,0.747448289735792,0.804265434539783,0.802688763273039,0.830723074901138,0.764481255966588,0.763544291735007,0.857584346872182,0.855769370478927,0.749581119393257,0.749525274475768,0.760116465090752,0.760114720534597,0.73842464136057,0.737699773605582,0.983016261172216,0.982845601088392,0.754235145229552,0.754859465807915,0.737845480509173,0.794077374354942,0.711699577657822,0.710904702260748,0.805976233203001,0.804961329027011,0.818459533960962,0.817804687953175,0.761210095381257,0.959106990149484,0.708146530229638,0.872727932858355,0.892617926934074,0.892286729324569,0.725426272450273,0.724305606038428,0.969093476174708,0.968786269123566,0.784727995616288,0.74217537136287,0.741053038584266,0.753046389689455,0.751392936100833,0.962430829176495,0.962037360161237,0.718816702274206,0.717758202462178,0.75498215199549,0.754567041155895,0.800182646929789,0.799877372250245,0.739623591841123,0.738725761515152,0.729826516966785,0.728498020982014,0.802262787000408,0.80130793383278,0.838476387147161,0.64792101496406,0.647124786683495,0.64573556866321,0.647515165646588,0.647433341228093,0.647129910628244,0.647455385967056,0.681315526749563,0.681324250292417,0.681765775079034,0.681931870195848,0.6811085300358,0.681390950328157,0.681830804748376,0.658490016369342,0.658552598496923,0.657266587596528,0.658369497199966,0.658664523928547,0.658832231653582,0.65823665072298,0.699139873390397,0.698532287485747,0.699841081572443,0.699424106360382,0.699785107559358,0.699567831736356,0.699177583741374,0.676885435113933,0.67812583512512,0.677477997441149,0.677820456708232,0.677656262148765,0.678134049282747,0.677804291026146,0.707990924220785,0.707975421519507,0.708182334775242,0.708745020048192,0.708033151785295,0.707734657107154,0.707672188862388
"ERR2584207",0.846082387370288,0.844877955393477,0.924867330714085,0.924357023831875,0.809692914541321,0.808109063964597,0.817921843220871,0.817588165058936,0.787573575843639,0.786691776225699,0.940552772850685,0.938709616342915,1,0.994416421984204,0.771150225706882,0.857331427029908,0.778285381291522,0.777939348657801,0.916140035799508,0.915369084349566,0.827251927285034,0.826094774544459,0.816837496082973,0.923772819076274,0.735507869896302,0.893399071102467,0.907461411749282,0.905792472052024,0.753503242751445,0.752957871123221,0.934371940269306,0.932851024327985,0.811444770505826,0.795215088451977,0.79453217021456,0.789357370390166,0.78894193405335,0.922747300863073,0.922495501112726,0.749109607551124,0.746178490423503,0.79422326220845,0.794055616240558,0.874001750607412,0.87234348302861,0.77517845763514,0.774588981504775,0.78471529082918,0.783364933344098,0.830659871138141,0.830546915817042,0.874996698406013,0.812765863146099,0.811818747513742,0.904726222747095,0.903676092467002,0.803471602272723,0.802643027302386,0.795506422993816,0.79568997179165,0.792620573267902,0.792357170833131,0.932590718933509,0.931980427027334,0.845075899826151,0.844341487672076,0.775190998678388,0.830025985079502,0.74724536719768,0.747484959248555,0.868144157269056,0.86682680828936,0.869536868740174,0.869181890746695,0.815870268614876,0.927264199589721,0.732549357433613,0.847718935355971,0.903740323756599,0.902727203233093,0.754697402194876,0.753992449773086,0.934972621322672,0.934218839056494,0.821520980859135,0.771027974341105,0.770424970618994,0.789186654660803,0.787408237137522,0.926446242252194,0.925896538856085,0.751043526505961,0.750237399065858,0.783431344369074,0.783259446352283,0.867106060327515,0.86661082552378,0.781190540672868,0.779828833193091,0.758306073506867,0.75783481099892,0.832075295108078,0.831061888602372,0.886822257800136,0.675285346083375,0.674247498575755,0.673990777412327,0.674882550217722,0.675281016043267,0.674634650627297,0.674715674353531,0.70588108843511,0.705601125642213,0.706058249828515,0.705838945382711,0.705483667798469,0.705814500836947,0.705935596929137,0.684339937804614,0.684351477885281,0.68322643634452,0.68418861767574,0.684159314223922,0.684415803414132,0.683832717073133,0.719607894705342,0.718726901708952,0.720458382924195,0.719778781021556,0.719637453522977,0.7198267565616,0.719557025488808,0.700952600113051,0.701743192606598,0.700708418269766,0.701174465859492,0.701124778501508,0.701796039173705,0.701100556810106,0.726730384598039,0.726427655804809,0.726707237812355,0.726912769933255,0.726836766543014,0.726280575639966,0.726204313637504
"ERR2584206",0.84441203771515,0.842986698963694,0.924684849030763,0.923778231376933,0.808620866860325,0.807124847600348,0.817559427101599,0.81707598011713,0.786428056471525,0.785950165095433,0.93947295818697,0.938250223217272,0.994416421984204,1,0.77101498075649,0.85651496307474,0.778373068466351,0.778150931056888,0.915427799487491,0.914905174504652,0.82690253259193,0.825768200008088,0.815642385323907,0.923152141759221,0.734542097728021,0.893021736071135,0.907132603285798,0.905327795907845,0.753370193064207,0.752451531707252,0.933544804503865,0.931845160085363,0.81089771549184,0.794089677103748,0.793008623851906,0.78914177831081,0.788523132155486,0.922076495177131,0.92152004325885,0.748729548720567,0.744962689317559,0.793552152369853,0.793344487646195,0.873497791988813,0.872008018677285,0.774094049794273,0.77385835290741,0.784267272507901,0.782914684615373,0.829842069992187,0.829246513431084,0.874716543301153,0.811743777736974,0.810760048372997,0.904209140392032,0.903428896817301,0.802538954435834,0.801795078864308,0.79497734239289,0.795207290816268,0.791925154205227,0.791793751794321,0.932059196586634,0.931674783228923,0.844960179582502,0.844153266432146,0.775049390879055,0.828653013432123,0.747141189661858,0.74763602287823,0.867936479652111,0.866396730953238,0.869282608434426,0.869047093384761,0.815092888987384,0.92666554266757,0.731554885638258,0.84754946315695,0.90357159460096,0.902635596479202,0.754170068889593,0.752753544522789,0.934621174859334,0.934115163873498,0.821158065793008,0.770197054864237,0.768910939773166,0.78882630653418,0.787206094383827,0.925810709696937,0.925506948802556,0.751404474128231,0.75017018734183,0.782690170252881,0.782271799802295,0.866673849988201,0.865990775694315,0.780038432912694,0.779096565140716,0.758000729635202,0.757450252453797,0.83099680799038,0.830187951517122,0.886408456632398,0.674772083150599,0.673901258092056,0.673438765346517,0.674153766980274,0.674587396042293,0.674364501475993,0.674518309875483,0.70458362201829,0.70482375591113,0.705145303287917,0.70506270384128,0.704533261490622,0.704962022007467,0.705188168446676,0.683863288403562,0.68385113752592,0.682781886967805,0.683658423265494,0.683794723978047,0.683755274005624,0.683238231484053,0.718525135642592,0.717897088632383,0.719403346291384,0.718848953660562,0.718850529904729,0.718869852564581,0.718471588249793,0.700215104304156,0.701262163839058,0.699913911053263,0.700560518567473,0.70067008411121,0.70129054385756,0.700677927701138,0.725669329575613,0.725675408472229,0.726044887999215,0.725999788855088,0.725906335514865,0.725272283039937,0.7253680310534
