<?xml version="1.0" encoding="UTF-8" standalone="yes"?>
<PMML xmlns="http://www.dmg.org/PMML-4_4" xmlns:data="http://jpmml.org/jpmml-model/InlineTable" version="4.4">
	<Header>
		<Application name="SkLearn2PMML package" version="0.111.0"/>
		<Timestamp>2024-11-18T09:49:32Z</Timestamp>
	</Header>
	<DataDictionary>
		<DataField name="meca_strainAtBreak" optype="categorical" dataType="string">
			<Value value="0.2-0.5"/>
			<Value value="0.5-0.8"/>
			<Value value="0.8-1.1"/>
		</DataField>
		<DataField name="granulo_D50" optype="continuous" dataType="double"/>
		<DataField name="compo_lignine" optype="continuous" dataType="double"/>
		<DataField name="compo_cellulose" optype="continuous" dataType="double"/>
		<DataField name="compo_hemicell" optype="continuous" dataType="double"/>
		<DataField name="compo_ash" optype="continuous" dataType="double"/>
		<DataField name="tdc_taux" optype="continuous" dataType="double"/>
	</DataDictionary>
	<TreeModel functionName="classification" algorithmName="sklearn.tree._classes.DecisionTreeClassifier" missingValueStrategy="nullPrediction">
		<MiningSchema>
			<MiningField name="meca_strainAtBreak" usageType="target"/>
			<MiningField name="tdc_taux"/>
			<MiningField name="compo_hemicell"/>
			<MiningField name="granulo_D50"/>
			<MiningField name="compo_cellulose"/>
			<MiningField name="compo_lignine"/>
			<MiningField name="compo_ash"/>
		</MiningSchema>
		<Output>
			<OutputField name="probability(0.2-0.5)" optype="continuous" dataType="double" feature="probability" value="0.2-0.5"/>
			<OutputField name="probability(0.5-0.8)" optype="continuous" dataType="double" feature="probability" value="0.5-0.8"/>
			<OutputField name="probability(0.8-1.1)" optype="continuous" dataType="double" feature="probability" value="0.8-1.1"/>
		</Output>
		<LocalTransformations>
			<DerivedField name="standardScaler(granulo_D50)" optype="continuous" dataType="double">
				<Apply function="/">
					<Apply function="-">
						<FieldRef field="granulo_D50"/>
						<Constant dataType="double">100.57920792079207</Constant>
					</Apply>
					<Constant dataType="double">83.69465284129025</Constant>
				</Apply>
			</DerivedField>
			<DerivedField name="standardScaler(compo_lignine)" optype="continuous" dataType="double">
				<Apply function="/">
					<Apply function="-">
						<FieldRef field="compo_lignine"/>
						<Constant dataType="double">23.342475247524764</Constant>
					</Apply>
					<Constant dataType="double">10.926055642039888</Constant>
				</Apply>
			</DerivedField>
			<DerivedField name="standardScaler(compo_cellulose)" optype="continuous" dataType="double">
				<Apply function="/">
					<Apply function="-">
						<FieldRef field="compo_cellulose"/>
						<Constant dataType="double">36.14267326732673</Constant>
					</Apply>
					<Constant dataType="double">20.788529914882357</Constant>
				</Apply>
			</DerivedField>
			<DerivedField name="standardScaler(compo_hemicell)" optype="continuous" dataType="double">
				<Apply function="/">
					<Apply function="-">
						<FieldRef field="compo_hemicell"/>
						<Constant dataType="double">13.14722772277228</Constant>
					</Apply>
					<Constant dataType="double">9.885826950371772</Constant>
				</Apply>
			</DerivedField>
			<DerivedField name="standardScaler(compo_ash)" optype="continuous" dataType="double">
				<Apply function="/">
					<Apply function="-">
						<FieldRef field="compo_ash"/>
						<Constant dataType="double">8.106653465346534</Constant>
					</Apply>
					<Constant dataType="double">7.054539690599973</Constant>
				</Apply>
			</DerivedField>
			<DerivedField name="standardScaler(tdc_taux)" optype="continuous" dataType="double">
				<Apply function="/">
					<Apply function="-">
						<FieldRef field="tdc_taux"/>
						<Constant dataType="double">14.50930693069307</Constant>
					</Apply>
					<Constant dataType="double">10.934796331289562</Constant>
				</Apply>
			</DerivedField>
			<DerivedField name="float(standardScaler(granulo_D50))" optype="continuous" dataType="float">
				<FieldRef field="standardScaler(granulo_D50)"/>
			</DerivedField>
			<DerivedField name="float(standardScaler(compo_lignine))" optype="continuous" dataType="float">
				<FieldRef field="standardScaler(compo_lignine)"/>
			</DerivedField>
			<DerivedField name="float(standardScaler(compo_cellulose))" optype="continuous" dataType="float">
				<FieldRef field="standardScaler(compo_cellulose)"/>
			</DerivedField>
			<DerivedField name="float(standardScaler(compo_hemicell))" optype="continuous" dataType="float">
				<FieldRef field="standardScaler(compo_hemicell)"/>
			</DerivedField>
			<DerivedField name="float(standardScaler(compo_ash))" optype="continuous" dataType="float">
				<FieldRef field="standardScaler(compo_ash)"/>
			</DerivedField>
			<DerivedField name="float(standardScaler(tdc_taux))" optype="continuous" dataType="float">
				<FieldRef field="standardScaler(tdc_taux)"/>
			</DerivedField>
			<DerivedField name="double(float(standardScaler(tdc_taux)))" optype="continuous" dataType="double">
				<FieldRef field="float(standardScaler(tdc_taux))"/>
			</DerivedField>
			<DerivedField name="double(float(standardScaler(compo_hemicell)))" optype="continuous" dataType="double">
				<FieldRef field="float(standardScaler(compo_hemicell))"/>
			</DerivedField>
			<DerivedField name="double(float(standardScaler(granulo_D50)))" optype="continuous" dataType="double">
				<FieldRef field="float(standardScaler(granulo_D50))"/>
			</DerivedField>
			<DerivedField name="double(float(standardScaler(compo_cellulose)))" optype="continuous" dataType="double">
				<FieldRef field="float(standardScaler(compo_cellulose))"/>
			</DerivedField>
			<DerivedField name="double(float(standardScaler(compo_lignine)))" optype="continuous" dataType="double">
				<FieldRef field="float(standardScaler(compo_lignine))"/>
			</DerivedField>
			<DerivedField name="double(float(standardScaler(compo_ash)))" optype="continuous" dataType="double">
				<FieldRef field="float(standardScaler(compo_ash))"/>
			</DerivedField>
		</LocalTransformations>
		<Node>
			<True/>
			<Node>
				<SimplePredicate field="double(float(standardScaler(tdc_taux)))" operator="lessOrEqual" value="0.18205122649669647"/>
				<Node>
					<SimplePredicate field="double(float(standardScaler(compo_hemicell)))" operator="lessOrEqual" value="-0.5292655527591705"/>
					<Node score="0.5-0.8" recordCount="1">
						<SimplePredicate field="double(float(standardScaler(granulo_D50)))" operator="lessOrEqual" value="2.370770275592804"/>
						<ScoreDistribution value="0.2-0.5" recordCount="0"/>
						<ScoreDistribution value="0.5-0.8" recordCount="1"/>
						<ScoreDistribution value="0.8-1.1" recordCount="0"/>
					</Node>
					<Node score="0.2-0.5" recordCount="1">
						<True/>
						<ScoreDistribution value="0.2-0.5" recordCount="1"/>
						<ScoreDistribution value="0.5-0.8" recordCount="0"/>
						<ScoreDistribution value="0.8-1.1" recordCount="0"/>
					</Node>
				</Node>
				<Node>
					<SimplePredicate field="double(float(standardScaler(compo_hemicell)))" operator="lessOrEqual" value="1.5894241333007812"/>
					<Node>
						<SimplePredicate field="double(float(standardScaler(granulo_D50)))" operator="lessOrEqual" value="-0.3474440276622772"/>
						<Node>
							<SimplePredicate field="double(float(standardScaler(tdc_taux)))" operator="lessOrEqual" value="-1.0068140923976898"/>
							<Node score="0.5-0.8" recordCount="1">
								<SimplePredicate field="double(float(standardScaler(compo_cellulose)))" operator="lessOrEqual" value="-0.4118941128253937"/>
								<ScoreDistribution value="0.2-0.5" recordCount="0"/>
								<ScoreDistribution value="0.5-0.8" recordCount="1"/>
								<ScoreDistribution value="0.8-1.1" recordCount="0"/>
							</Node>
							<Node score="0.8-1.1" recordCount="1">
								<True/>
								<ScoreDistribution value="0.2-0.5" recordCount="0"/>
								<ScoreDistribution value="0.5-0.8" recordCount="0"/>
								<ScoreDistribution value="0.8-1.1" recordCount="1"/>
							</Node>
						</Node>
						<Node score="0.5-0.8" recordCount="1">
							<True/>
							<ScoreDistribution value="0.2-0.5" recordCount="0"/>
							<ScoreDistribution value="0.5-0.8" recordCount="1"/>
							<ScoreDistribution value="0.8-1.1" recordCount="0"/>
						</Node>
					</Node>
					<Node score="0.5-0.8" recordCount="1">
						<SimplePredicate field="double(float(standardScaler(compo_lignine)))" operator="lessOrEqual" value="-0.4125436842441559"/>
						<ScoreDistribution value="0.2-0.5" recordCount="0"/>
						<ScoreDistribution value="0.5-0.8" recordCount="1"/>
						<ScoreDistribution value="0.8-1.1" recordCount="0"/>
					</Node>
					<Node score="0.8-1.1" recordCount="1">
						<SimplePredicate field="double(float(standardScaler(compo_ash)))" operator="lessOrEqual" value="-0.8224000036716461"/>
						<ScoreDistribution value="0.2-0.5" recordCount="0"/>
						<ScoreDistribution value="0.5-0.8" recordCount="0"/>
						<ScoreDistribution value="0.8-1.1" recordCount="1"/>
					</Node>
					<Node>
						<SimplePredicate field="double(float(standardScaler(compo_ash)))" operator="lessOrEqual" value="-0.6065815389156342"/>
						<Node score="0.5-0.8" recordCount="1">
							<SimplePredicate field="double(float(standardScaler(compo_cellulose)))" operator="lessOrEqual" value="-0.28658463060855865"/>
							<ScoreDistribution value="0.2-0.5" recordCount="0"/>
							<ScoreDistribution value="0.5-0.8" recordCount="1"/>
							<ScoreDistribution value="0.8-1.1" recordCount="0"/>
						</Node>
						<Node score="0.8-1.1" recordCount="1">
							<SimplePredicate field="double(float(standardScaler(tdc_taux)))" operator="lessOrEqual" value="-1.0068140923976898"/>
							<ScoreDistribution value="0.2-0.5" recordCount="0"/>
							<ScoreDistribution value="0.5-0.8" recordCount="0"/>
							<ScoreDistribution value="0.8-1.1" recordCount="1"/>
						</Node>
						<Node score="0.5-0.8" recordCount="1">
							<True/>
							<ScoreDistribution value="0.2-0.5" recordCount="0"/>
							<ScoreDistribution value="0.5-0.8" recordCount="1"/>
							<ScoreDistribution value="0.8-1.1" recordCount="0"/>
						</Node>
					</Node>
					<Node>
						<SimplePredicate field="double(float(standardScaler(compo_lignine)))" operator="lessOrEqual" value="1.504891186952591"/>
						<Node>
							<SimplePredicate field="double(float(standardScaler(compo_ash)))" operator="lessOrEqual" value="1.7078855633735657"/>
							<Node>
								<SimplePredicate field="double(float(standardScaler(tdc_taux)))" operator="lessOrEqual" value="-0.4123814254999161"/>
								<Node score="0.5-0.8" recordCount="1">
									<SimplePredicate field="double(float(standardScaler(compo_cellulose)))" operator="lessOrEqual" value="-0.6882484257221222"/>
									<ScoreDistribution value="0.2-0.5" recordCount="0"/>
									<ScoreDistribution value="0.5-0.8" recordCount="1"/>
									<ScoreDistribution value="0.8-1.1" recordCount="0"/>
								</Node>
								<Node score="0.8-1.1" recordCount="1">
									<True/>
									<ScoreDistribution value="0.2-0.5" recordCount="0"/>
									<ScoreDistribution value="0.5-0.8" recordCount="0"/>
									<ScoreDistribution value="0.8-1.1" recordCount="1"/>
								</Node>
							</Node>
							<Node score="0.8-1.1" recordCount="1">
								<SimplePredicate field="double(float(standardScaler(compo_cellulose)))" operator="lessOrEqual" value="-0.6882484257221222"/>
								<ScoreDistribution value="0.2-0.5" recordCount="0"/>
								<ScoreDistribution value="0.5-0.8" recordCount="0"/>
								<ScoreDistribution value="0.8-1.1" recordCount="1"/>
							</Node>
							<Node score="0.5-0.8" recordCount="1">
								<True/>
								<ScoreDistribution value="0.2-0.5" recordCount="0"/>
								<ScoreDistribution value="0.5-0.8" recordCount="1"/>
								<ScoreDistribution value="0.8-1.1" recordCount="0"/>
							</Node>
						</Node>
						<Node>
							<SimplePredicate field="double(float(standardScaler(tdc_taux)))" operator="lessOrEqual" value="-0.4123814254999161"/>
							<Node score="0.5-0.8" recordCount="1">
								<SimplePredicate field="double(float(standardScaler(compo_hemicell)))" operator="lessOrEqual" value="-0.066481813788414"/>
								<ScoreDistribution value="0.2-0.5" recordCount="0"/>
								<ScoreDistribution value="0.5-0.8" recordCount="1"/>
								<ScoreDistribution value="0.8-1.1" recordCount="0"/>
							</Node>
							<Node score="0.8-1.1" recordCount="1">
								<True/>
								<ScoreDistribution value="0.2-0.5" recordCount="0"/>
								<ScoreDistribution value="0.5-0.8" recordCount="0.22666666666666666"/>
								<ScoreDistribution value="0.8-1.1" recordCount="0.7733333333333333"/>
							</Node>
						</Node>
						<Node score="0.8-1.1" recordCount="1">
							<True/>
							<ScoreDistribution value="0.2-0.5" recordCount="0"/>
							<ScoreDistribution value="0.5-0.8" recordCount="0"/>
							<ScoreDistribution value="0.8-1.1" recordCount="1"/>
						</Node>
					</Node>
					<Node score="0.8-1.1" recordCount="1">
						<True/>
						<ScoreDistribution value="0.2-0.5" recordCount="0"/>
						<ScoreDistribution value="0.5-0.8" recordCount="0"/>
						<ScoreDistribution value="0.8-1.1" recordCount="1"/>
					</Node>
				</Node>
				<Node>
					<SimplePredicate field="double(float(standardScaler(granulo_D50)))" operator="lessOrEqual" value="-0.23811805248260498"/>
					<Node score="0.8-1.1" recordCount="1">
						<SimplePredicate field="double(float(standardScaler(tdc_taux)))" operator="lessOrEqual" value="-0.4123814254999161"/>
						<ScoreDistribution value="0.2-0.5" recordCount="0"/>
						<ScoreDistribution value="0.5-0.8" recordCount="0"/>
						<ScoreDistribution value="0.8-1.1" recordCount="1"/>
					</Node>
					<Node score="0.5-0.8" recordCount="1">
						<True/>
						<ScoreDistribution value="0.2-0.5" recordCount="0"/>
						<ScoreDistribution value="0.5-0.8" recordCount="1"/>
						<ScoreDistribution value="0.8-1.1" recordCount="0"/>
					</Node>
				</Node>
				<Node score="0.5-0.8" recordCount="1">
					<SimplePredicate field="double(float(standardScaler(tdc_taux)))" operator="lessOrEqual" value="-0.4123814254999161"/>
					<ScoreDistribution value="0.2-0.5" recordCount="0"/>
					<ScoreDistribution value="0.5-0.8" recordCount="1"/>
					<ScoreDistribution value="0.8-1.1" recordCount="0"/>
				</Node>
				<Node score="0.2-0.5" recordCount="1">
					<True/>
					<ScoreDistribution value="0.2-0.5" recordCount="0.6904761904761905"/>
					<ScoreDistribution value="0.5-0.8" recordCount="0.30952380952380953"/>
					<ScoreDistribution value="0.8-1.1" recordCount="0"/>
				</Node>
			</Node>
			<Node>
				<SimplePredicate field="double(float(standardScaler(compo_lignine)))" operator="lessOrEqual" value="-0.3471037745475769"/>
				<Node score="0.5-0.8" recordCount="1">
					<SimplePredicate field="double(float(standardScaler(granulo_D50)))" operator="lessOrEqual" value="-0.9950361847877502"/>
					<ScoreDistribution value="0.2-0.5" recordCount="0"/>
					<ScoreDistribution value="0.5-0.8" recordCount="1"/>
					<ScoreDistribution value="0.8-1.1" recordCount="0"/>
				</Node>
				<Node score="0.2-0.5" recordCount="1">
					<True/>
					<ScoreDistribution value="0.2-0.5" recordCount="1"/>
					<ScoreDistribution value="0.5-0.8" recordCount="0"/>
					<ScoreDistribution value="0.8-1.1" recordCount="0"/>
				</Node>
			</Node>
			<Node>
				<SimplePredicate field="double(float(standardScaler(compo_hemicell)))" operator="lessOrEqual" value="0.3295396864414215"/>
				<Node>
					<SimplePredicate field="double(float(standardScaler(compo_lignine)))" operator="lessOrEqual" value="0.643189549446106"/>
					<Node>
						<SimplePredicate field="double(float(standardScaler(tdc_taux)))" operator="lessOrEqual" value="0.9593861997127533"/>
						<Node>
							<SimplePredicate field="double(float(standardScaler(compo_lignine)))" operator="lessOrEqual" value="0.5132249742746353"/>
							<Node score="0.5-0.8" recordCount="1">
								<SimplePredicate field="double(float(standardScaler(granulo_D50)))" operator="lessOrEqual" value="0.08866509795188904"/>
								<ScoreDistribution value="0.2-0.5" recordCount="0"/>
								<ScoreDistribution value="0.5-0.8" recordCount="1"/>
								<ScoreDistribution value="0.8-1.1" recordCount="0"/>
							</Node>
							<Node score="0.5-0.8" recordCount="1">
								<True/>
								<ScoreDistribution value="0.2-0.5" recordCount="0"/>
								<ScoreDistribution value="0.5-0.8" recordCount="1"/>
								<ScoreDistribution value="0.8-1.1" recordCount="0"/>
							</Node>
						</Node>
						<Node score="0.2-0.5" recordCount="1">
							<True/>
							<ScoreDistribution value="0.2-0.5" recordCount="1"/>
							<ScoreDistribution value="0.5-0.8" recordCount="0"/>
							<ScoreDistribution value="0.8-1.1" recordCount="0"/>
						</Node>
					</Node>
					<Node score="0.2-0.5" recordCount="1">
						<True/>
						<ScoreDistribution value="0.2-0.5" recordCount="1"/>
						<ScoreDistribution value="0.5-0.8" recordCount="0"/>
						<ScoreDistribution value="0.8-1.1" recordCount="0"/>
					</Node>
				</Node>
				<Node score="0.5-0.8" recordCount="1">
					<True/>
					<ScoreDistribution value="0.2-0.5" recordCount="0"/>
					<ScoreDistribution value="0.5-0.8" recordCount="1"/>
					<ScoreDistribution value="0.8-1.1" recordCount="0"/>
				</Node>
			</Node>
			<Node score="0.2-0.5" recordCount="1">
				<SimplePredicate field="double(float(standardScaler(granulo_D50)))" operator="lessOrEqual" value="-0.21601389348506927"/>
				<ScoreDistribution value="0.2-0.5" recordCount="1"/>
				<ScoreDistribution value="0.5-0.8" recordCount="0"/>
				<ScoreDistribution value="0.8-1.1" recordCount="0"/>
			</Node>
			<Node>
				<SimplePredicate field="double(float(standardScaler(compo_hemicell)))" operator="lessOrEqual" value="1.5894241333007812"/>
				<Node>
					<SimplePredicate field="double(float(standardScaler(tdc_taux)))" operator="lessOrEqual" value="0.9593861997127533"/>
					<Node score="0.2-0.5" recordCount="1">
						<SimplePredicate field="double(float(standardScaler(compo_cellulose)))" operator="lessOrEqual" value="-0.23800014704465866"/>
						<ScoreDistribution value="0.2-0.5" recordCount="1"/>
						<ScoreDistribution value="0.5-0.8" recordCount="0"/>
						<ScoreDistribution value="0.8-1.1" recordCount="0"/>
					</Node>
					<Node score="0.5-0.8" recordCount="1">
						<True/>
						<ScoreDistribution value="0.2-0.5" recordCount="0"/>
						<ScoreDistribution value="0.5-0.8" recordCount="1"/>
						<ScoreDistribution value="0.8-1.1" recordCount="0"/>
					</Node>
				</Node>
				<Node score="0.8-1.1" recordCount="1">
					<SimplePredicate field="double(float(standardScaler(compo_hemicell)))" operator="lessOrEqual" value="0.3811286985874176"/>
					<ScoreDistribution value="0.2-0.5" recordCount="0.39534883720930236"/>
					<ScoreDistribution value="0.5-0.8" recordCount="0"/>
					<ScoreDistribution value="0.8-1.1" recordCount="0.6046511627906977"/>
				</Node>
				<Node score="0.8-1.1" recordCount="1">
					<True/>
					<ScoreDistribution value="0.2-0.5" recordCount="0"/>
					<ScoreDistribution value="0.5-0.8" recordCount="0"/>
					<ScoreDistribution value="0.8-1.1" recordCount="1"/>
				</Node>
			</Node>
			<Node score="0.2-0.5" recordCount="1">
				<True/>
				<ScoreDistribution value="0.2-0.5" recordCount="0.6904761904761905"/>
				<ScoreDistribution value="0.5-0.8" recordCount="0.30952380952380953"/>
				<ScoreDistribution value="0.8-1.1" recordCount="0"/>
			</Node>
		</Node>
	</TreeModel>
</PMML>
