"Glutamicibacter Montesquieu"	"Brevibacterium Rousseau"	"Psychrobacter D_Alembert"	"Lactococcus P335 group"	"Leuconostoc Diderot"	"Streptococcus 987 group"	"Lactococcus KSY1 group"	"Lactococcus 949 group"	"Lactococcus 936 group"	"Psychrobacter"	"Lactococcus"	"Glutamicibacter"	"Vibrio"	"Leuconostoc"	"Pseudoalteromonas"	"Cobetia"	"Marinomonas"	"Bacteroides"	"Prevotella"	"Mesonia"	"Brevibacterium"	"Ruminococcus"
"Glutamicibacter Montesquieu"	1	0.91	0.61	-0.62	0.03	-0.59	-0.72	0.28	-0.39	0.73	-0.9	0.91	0.45	-0.84	0.85	0.48	0.77	-0.54	-0.29	0.78	0.11	-0.69
"Brevibacterium Rousseau"	0.91	1	0.67	-0.55	0.2	-0.62	-0.72	0.1	-0.3	0.86	-0.96	0.91	0.58	-0.81	0.89	0.4	0.86	-0.41	-0.29	0.77	-0.01	-0.81
"Psychrobacter D_Alembert"	0.61	0.67	1	-0.3	0.31	-0.36	-0.54	0.23	-0.3	0.38	-0.65	0.62	0.28	-0.58	0.73	0.08	0.82	0.03	-0.27	0.63	-0.3	-0.62
"Lactococcus P335 group"	-0.62	-0.55	-0.3	1	-0.1	0.86	0.6	0.32	-0.28	-0.56	0.59	-0.53	-0.66	0.54	-0.58	-0.41	-0.61	0.19	0.08	-0.47	0.13	0.49
"Leuconostoc Diderot"	0.03	0.2	0.31	-0.1	1	-0.2	-0.36	-0.37	0.17	0.12	-0.14	0.04	0.32	0.05	0.33	-0.06	0.37	0.09	0.11	0.2	-0.12	-0.37
"Streptococcus 987 group"	-0.59	-0.62	-0.36	0.86	-0.2	1	0.71	0.32	-0.28	-0.7	0.69	-0.57	-0.81	0.54	-0.68	-0.31	-0.7	0.24	0.13	-0.43	0.07	0.52
"Lactococcus KSY1 group"	-0.72	-0.72	-0.54	0.6	-0.36	0.71	1	-0.15	-0.02	-0.66	0.73	-0.63	-0.58	0.61	-0.66	-0.19	-0.73	0.22	0.48	-0.61	-0.13	0.64
"Lactococcus 949 group"	0.28	0.1	0.23	0.32	-0.37	0.32	-0.15	1	-0.65	-0.04	-0.11	0.22	-0.33	-0.22	0.01	-0.15	-0.03	-0.14	-0.13	0.31	0.11	-0.01
"Lactococcus 936 group"	-0.39	-0.3	-0.3	-0.28	0.17	-0.28	-0.02	-0.65	1	-0.03	0.33	-0.43	0.44	0.45	-0.29	0.06	-0.15	0.39	0.02	-0.45	-0.05	0.16
"Psychrobacter"	0.73	0.86	0.38	-0.56	0.12	-0.7	-0.66	-0.04	-0.03	1	-0.84	0.78	0.72	-0.65	0.75	0.5	0.65	-0.38	-0.13	0.68	0.09	-0.7
"Lactococcus"	-0.9	-0.96	-0.65	0.59	-0.14	0.69	0.73	-0.11	0.33	-0.84	1	-0.95	-0.58	0.86	-0.93	-0.43	-0.88	0.42	0.3	-0.8	0.02	0.71
"Glutamicibacter"	0.91	0.91	0.62	-0.53	0.04	-0.57	-0.63	0.22	-0.43	0.78	-0.95	1	0.49	-0.93	0.92	0.58	0.81	-0.5	-0.3	0.8	0	-0.7
"Vibrio"	0.45	0.58	0.28	-0.66	0.32	-0.81	-0.58	-0.33	0.44	0.72	-0.58	0.49	1	-0.39	0.6	0.4	0.63	-0.04	0.01	0.27	-0.23	-0.5
"Leuconostoc"	-0.84	-0.81	-0.58	0.54	0.05	0.54	0.61	-0.22	0.45	-0.65	0.86	-0.93	-0.39	1	-0.8	-0.42	-0.74	0.38	0.42	-0.69	0.09	0.69
"Pseudoalteromonas"	0.85	0.89	0.73	-0.58	0.33	-0.68	-0.66	0.01	-0.29	0.75	-0.93	0.92	0.6	-0.8	1	0.54	0.9	-0.45	-0.16	0.78	-0.04	-0.7
"Cobetia"	0.48	0.4	0.08	-0.41	-0.06	-0.31	-0.19	-0.15	0.06	0.5	-0.43	0.58	0.4	-0.42	0.54	1	0.27	-0.51	-0.08	0.35	0.35	-0.23
"Marinomonas"	0.77	0.86	0.82	-0.61	0.37	-0.7	-0.73	-0.03	-0.15	0.65	-0.88	0.81	0.63	-0.74	0.9	0.27	1	-0.21	-0.27	0.68	-0.3	-0.76
"Bacteroides"	-0.54	-0.41	0.03	0.19	0.09	0.24	0.22	-0.14	0.39	-0.38	0.42	-0.5	-0.04	0.38	-0.45	-0.51	-0.21	1	-0.02	-0.44	-0.44	0.35
"Prevotella"	-0.29	-0.29	-0.27	0.08	0.11	0.13	0.48	-0.13	0.02	-0.13	0.3	-0.3	0.01	0.42	-0.16	-0.08	-0.27	-0.02	1	-0.05	-0.34	0.18
"Mesonia"	0.78	0.77	0.63	-0.47	0.2	-0.43	-0.61	0.31	-0.45	0.68	-0.8	0.8	0.27	-0.69	0.78	0.35	0.68	-0.44	-0.05	1	0	-0.68
"Brevibacterium"	0.11	-0.01	-0.3	0.13	-0.12	0.07	-0.13	0.11	-0.05	0.09	0.02	0	-0.23	0.09	-0.04	0.35	-0.3	-0.44	-0.34	0	1	0.28
"Ruminococcus"	-0.69	-0.81	-0.62	0.49	-0.37	0.52	0.64	-0.01	0.16	-0.7	0.71	-0.7	-0.5	0.69	-0.7	-0.23	-0.76	0.35	0.18	-0.68	0.28	1
